335 YHX


335YHX is registered to a Red 1960, Morris Mini with a Petrol engine. It Failed its most recent MOT Test on the 22 December 2010

14 unique faults (14 Total) reported in its MOT History (4 Tests).

0 common/recurring faults.

50% (2) MOT Pass Rate and a 50% (2) MOT Failure Rate.

46,462 recorded miles.

335 YHX


335YHX is registered to a Red 1960, Morris Mini with a Petrol engine. It Failed its most recent MOT Test on the 22 December 2010

14 unique faults (14 Total) reported in its MOT History (4 Tests).

0 common/recurring faults.

50% (2) MOT Pass Rate and a 50% (2) MOT Failure Rate.

46,462 recorded miles.

MOT PASS/Failure rate for 335 YHX

all MOT test results for 335 YHX represented as a percentage
MOT PASS/Failure rate for 335 YHX
all MOT test results for 335 YHX represented as a percentage

PERCENTAGE OF VEHICLE FAULTS WITH 335 YHX

ALL REPORTED FAULTS, DISPLAYED BY PERCENTAGE OF OCCURRENCE DURING ALL MOT TESTS
PERCENTAGE OF VEHICLE FAULTS WITH 335 YHX
ALL REPORTED FAULTS, DISPLAYED BY PERCENTAGE OF OCCURRENCE DURING ALL MOT TESTS
ADVISORY

FAIL

335 YHX annual Faults by type

ALL REPORTED FAULTS, DISPLAYED over time and categorised by type
335 YHX annual Faults by type
ALL REPORTED FAULTS, DISPLAYED over time and categorised by type

ALL 335 YHX ADVISORIES [1]

ALL ADVISORIES, ORDERED by OCCURRENCE DURING 335 YHX's MOT HISTORY
ALL 335 YHX ADVISORIES [1]
ALL ADVISORIES, ORDERED by OCCURRENCE DURING 335 YHX's MOT HISTORY
Fail Faults | source www.vehiclestats.co.uk
Fault Fault Test Date Test Date/Time Reference MOT Test Reference
1 Nearside rear service brake: service brake efficiency only just met. It would appear that the braking system requires adjustment or repair. (3.7.b.7) Nearside rear service brake: service brake efficiency only just met. It would appear that the braking system requires adjustment or repair. (3.7.b.7) 20 December 2010 [14:29] 20/12/2010 561324750384 561324750384

ALL 335 YHX Failure Faults [13]

ALL Failure faults, ORDERED by OCCURRENCE DURING 335 YHX's MOT HISTORY
ALL 335 YHX Failure Faults [13]
ALL Failure faults, ORDERED by OCCURRENCE DURING 335 YHX's MOT HISTORY
Fail Faults | source www.vehiclestats.co.uk
Fault Fault Test Date Test Date/Time Reference MOT Test Reference
1 Front headlamp not working on dipped beam (1.7.5a) Front headlamp not working on dipped beam (1.7.5a) 20 December 2010 [14:29] 20/12/2010 561324750384 561324750384
1 Offside front headlamp not working on dipped beam (1.7.5a) Offside front headlamp not working on dipped beam (1.7.5a) 20 December 2010 [14:29] 20/12/2010 561324750384 561324750384
1 Nearside front radius arm has excessive play in a ball joint (2.4.g.2) Nearside front radius arm has excessive play in a ball joint (2.4.g.2) 20 December 2010 [14:29] 20/12/2010 561324750384 561324750384
1 Offside inner seat belt anchorage prescribed area is excessively corroded (5.2.6) Offside inner seat belt anchorage prescribed area is excessively corroded (5.2.6) 07 September 2009 [09:52] 07/09/2009 723370059279 723370059279
1 Offside outer seat belt anchorage prescribed area is excessively corroded (5.2.6) Offside outer seat belt anchorage prescribed area is excessively corroded (5.2.6) 07 September 2009 [09:52] 07/09/2009 723370059279 723370059279
1 Nearside outer seat belt anchorage prescribed area is inadequately repaired (5.2.6) Nearside outer seat belt anchorage prescribed area is inadequately repaired (5.2.6) 07 September 2009 [09:52] 07/09/2009 723370059279 723370059279
1 Offside outer seat belt anchorage prescribed area is inadequately repaired (5.2.6) Offside outer seat belt anchorage prescribed area is inadequately repaired (5.2.6) 07 September 2009 [09:52] 07/09/2009 723370059279 723370059279
1 Windscreen washer provides insufficient washer liquid (8.2.3) Windscreen washer provides insufficient washer liquid (8.2.3) 07 September 2009 [09:52] 07/09/2009 723370059279 723370059279
1 Nearside rear upper shock absorber has an excessively worn bush (2.7.4) Nearside rear upper shock absorber has an excessively worn bush (2.7.4) 07 September 2009 [09:52] 07/09/2009 723370059279 723370059279
1 Offside rear lower shock absorber insecure (2.7.2b) Offside rear lower shock absorber insecure (2.7.2b) 07 September 2009 [09:52] 07/09/2009 723370059279 723370059279
1 Nearside rear sub-frame attachment bracket/mounting insecure (2.4.g.1) Nearside rear sub-frame attachment bracket/mounting insecure (2.4.g.1) 07 September 2009 [09:52] 07/09/2009 723370059279 723370059279
1 Service brake: efficiency below requirements (3.7.b.7) Service brake: efficiency below requirements (3.7.b.7) 07 September 2009 [09:52] 07/09/2009 723370059279 723370059279
1 Parking brake: efficiency below requirements (3.7.b.7) Parking brake: efficiency below requirements (3.7.b.7) 07 September 2009 [09:52] 07/09/2009 723370059279 723370059279

MOT TEST: 22 December 2010 08:25:31 PASSED
MOT TEST: 22 December 2010 08:25:31 PASSED

This test (130626450388) was completed on the 22 December 2010 08:25:31 and PASSED the requirements for a valid MOT with 0 comments.

This test (130626450388) was completed on the 22 December 2010 08:25:31 and PASSED the requirements for a valid MOT with 0 comments.

Recorded mileage: 19,066

Recorded mileage: 19,066


MOT TEST: 20 December 2010 14:29:10 FAILED
MOT TEST: 20 December 2010 14:29:10 FAILED

This test (561324750384) was completed on the 20 December 2010 14:29:10 and FAILED the requirements for a valid MOT with 4 comments.

This test (561324750384) was completed on the 20 December 2010 14:29:10 and FAILED the requirements for a valid MOT with 4 comments.

Recorded mileage: 19,064

Recorded mileage: 19,064


ADVISORY

FAIL


MOT TEST: 25 September 2009 08:48:38 PASSED
MOT TEST: 25 September 2009 08:48:38 PASSED

This test (391418869496) was completed on the 25 September 2009 08:48:38 and PASSED the requirements for a valid MOT with 0 comments.

This test (391418869496) was completed on the 25 September 2009 08:48:38 and PASSED the requirements for a valid MOT with 0 comments.

Recorded mileage: 46,462

Recorded mileage: 46,462


MOT TEST: 07 September 2009 09:52:00 FAILED
MOT TEST: 07 September 2009 09:52:00 FAILED

This test (723370059279) was completed on the 07 September 2009 09:52:00 and FAILED the requirements for a valid MOT with 10 comments.

This test (723370059279) was completed on the 07 September 2009 09:52:00 and FAILED the requirements for a valid MOT with 10 comments.

Recorded mileage: 46,460

Recorded mileage: 46,460


FAIL