339 VHU


339VHU is registered to a Blue 1964, Morris Minor traveller with a Petrol engine. It Passed its most recent MOT Test on the 03 May 2018

41 unique faults (54 Total) reported in its MOT History (22 Tests).

11 common/recurring faults, the most frequent (3 times) is: Service brake: efficiency below requirements (3.7.B.7).

59% (13) MOT Pass Rate and a 41% (9) MOT Failure Rate.

106,918 recorded miles.

339 VHU


339VHU is registered to a Blue 1964, Morris Minor traveller with a Petrol engine. It Passed its most recent MOT Test on the 03 May 2018

41 unique faults (54 Total) reported in its MOT History (22 Tests).

11 common/recurring faults, the most frequent (3 times) is: Service brake: efficiency below requirements (3.7.B.7).

59% (13) MOT Pass Rate and a 41% (9) MOT Failure Rate.

106,918 recorded miles.

MOT PASS/Failure rate for 339 VHU

all MOT test results for 339 VHU represented as a percentage
MOT PASS/Failure rate for 339 VHU
all MOT test results for 339 VHU represented as a percentage

PERCENTAGE OF VEHICLE FAULTS WITH 339 VHU

ALL REPORTED FAULTS, DISPLAYED BY PERCENTAGE OF OCCURRENCE DURING ALL MOT TESTS
PERCENTAGE OF VEHICLE FAULTS WITH 339 VHU
ALL REPORTED FAULTS, DISPLAYED BY PERCENTAGE OF OCCURRENCE DURING ALL MOT TESTS
ADVISORY

FAIL

USER ENTERED

339 VHU annual Faults by type

ALL REPORTED FAULTS, DISPLAYED over time and categorised by type
339 VHU annual Faults by type
ALL REPORTED FAULTS, DISPLAYED over time and categorised by type

RECURRING FAULTS WITH 339 VHU

FAULTS THAT HAVE OCCURED MORE THAN ONCE DURING 339 VHU's MOT HISTORY
RECURRING FAULTS WITH 339 VHU
FAULTS THAT HAVE OCCURED MORE THAN ONCE DURING 339 VHU's MOT HISTORY
Fault Fault Test Date Test Date/Time Reference MOT Test Reference
3 Service brake: efficiency below requirements (3.7.b.7) Service brake: efficiency below requirements (3.7.b.7) 14 October 2013 [10:47] 14/10/2013 30 September 2011 [10:49] 30/09/2011 21 November 2007 [10:09] 21/11/2007 915487383299 915487383299 415923071204 415923071204 290885127394 290885127394
3 Nearside rear parking brake recording little or no effort (3.7.b.6a) Nearside rear parking brake recording little or no effort (3.7.b.6a) 30 September 2011 [10:49] 30/09/2011 30 June 2009 [08:58] 30/06/2009 21 November 2008 [14:27] 21/11/2008 415923071204 415923071204 203211989182 203211989182 373716428377 373716428377
2 Nearside rear suspension spring mounting prescribed area is excessively corroded (2.4.a.3) Nearside rear suspension spring mounting prescribed area is excessively corroded (2.4.a.3) 12 October 2016 [11:42] 12/10/2016 30 September 2011 [10:49] 30/09/2011 474292029416 474292029416 415923071204 415923071204
2 Near side front lower trunion joint has slight play Near side front lower trunion joint has slight play 15 October 2013 [14:29] 15/10/2013 14 October 2013 [10:47] 14/10/2013 458208183243 458208183243 915487383299 915487383299
2 Nearside rear rear brake recording little or no effort (3.7.b.5a) Nearside rear rear brake recording little or no effort (3.7.b.5a) 14 October 2013 [10:47] 14/10/2013 30 September 2011 [10:49] 30/09/2011 915487383299 915487383299 415923071204 415923071204
2 Brakes imbalanced across an axle (3.7.b.5b) Brakes imbalanced across an axle (3.7.b.5b) 14 October 2013 [10:47] 14/10/2013 30 September 2011 [10:49] 30/09/2011 915487383299 915487383299 415923071204 415923071204
2 Corrosoin on nearside inner wing Corrosoin on nearside inner wing 09 October 2009 [14:54] 09/10/2009 06 October 2009 [16:06] 06/10/2009 662112389228 662112389228 944109479207 944109479207
2 Nearside headlamp not working on dipped beam (1.7.5a) Nearside headlamp not working on dipped beam (1.7.5a) 06 October 2009 [16:06] 06/10/2009 30 June 2009 [08:58] 30/06/2009 944109479207 944109479207 203211989182 203211989182
2 Parking brake: efficiency below requirements (3.7.b.7) Parking brake: efficiency below requirements (3.7.b.7) 30 June 2009 [08:58] 30/06/2009 21 November 2008 [14:27] 21/11/2008 203211989182 203211989182 373716428377 373716428377
2 Offside outer rear suspension component mounting prescribed area is corroded but not considered excessive (2.4.a.3) Offside outer rear suspension component mounting prescribed area is corroded but not considered excessive (2.4.a.3) 21 November 2007 [15:10] 21/11/2007 21 November 2007 [10:09] 21/11/2007 281545927379 281545927379 290885127394 290885127394
2 Offside front lower suspension arm rubber bush deteriorated but not resulting in excessive movement (2.4.g.2) Offside front lower suspension arm rubber bush deteriorated but not resulting in excessive movement (2.4.g.2) 08 November 2006 [10:25] 08/11/2006 07 November 2006 [12:29] 07/11/2006 821162416337 821162416337 424461416390 424461416390

ALL 339 VHU ADVISORIES [8]

ALL ADVISORIES, ORDERED by OCCURRENCE DURING 339 VHU's MOT HISTORY
ALL 339 VHU ADVISORIES [8]
ALL ADVISORIES, ORDERED by OCCURRENCE DURING 339 VHU's MOT HISTORY
Advisory Faults | source www.vehiclestats.co.uk
Fault Fault Test Date Test Date/Time Reference MOT Test Reference
2 Offside outer rear suspension component mounting prescribed area is corroded but not considered excessive (2.4.a.3) Offside outer rear suspension component mounting prescribed area is corroded but not considered excessive (2.4.a.3) 21 November 2007 [15:10] 21/11/2007 21 November 2007 [10:09] 21/11/2007 281545927379 281545927379 290885127394 290885127394
2 Offside front lower suspension arm rubber bush deteriorated but not resulting in excessive movement (2.4.g.2) Offside front lower suspension arm rubber bush deteriorated but not resulting in excessive movement (2.4.g.2) 08 November 2006 [10:25] 08/11/2006 07 November 2006 [12:29] 07/11/2006 821162416337 821162416337 424461416390 424461416390
1 Braking only just meeting requirements it would appear that the system requires attention Braking only just meeting requirements it would appear that the system requires attention 10 April 2017 [11:10] 10/04/2017 974006997186 974006997186
1 Nearside front inner wheel arch corroded Nearside front inner wheel arch corroded 12 October 2016 [11:42] 12/10/2016 474292029416 474292029416
1 Nearside rear corrossion at bump stop mounting point Nearside rear corrossion at bump stop mounting point 12 October 2016 [11:42] 12/10/2016 474292029416 474292029416
1 Slight fliud leak from rear axle seals Slight fliud leak from rear axle seals 12 October 2016 [11:42] 12/10/2016 474292029416 474292029416

ALL 339 VHU Failure Faults [42]

ALL Failure faults, ORDERED by OCCURRENCE DURING 339 VHU's MOT HISTORY
ALL 339 VHU Failure Faults [42]
ALL Failure faults, ORDERED by OCCURRENCE DURING 339 VHU's MOT HISTORY
Fail Faults | source www.vehiclestats.co.uk
Fault Fault Test Date Test Date/Time Reference MOT Test Reference
3 Service brake: efficiency below requirements (3.7.b.7) Service brake: efficiency below requirements (3.7.b.7) 14 October 2013 [10:47] 14/10/2013 30 September 2011 [10:49] 30/09/2011 21 November 2007 [10:09] 21/11/2007 915487383299 915487383299 415923071204 415923071204 290885127394 290885127394
3 Nearside rear parking brake recording little or no effort (3.7.b.6a) Nearside rear parking brake recording little or no effort (3.7.b.6a) 30 September 2011 [10:49] 30/09/2011 30 June 2009 [08:58] 30/06/2009 21 November 2008 [14:27] 21/11/2008 415923071204 415923071204 203211989182 203211989182 373716428377 373716428377
2 Nearside rear suspension spring mounting prescribed area is excessively corroded (2.4.a.3) Nearside rear suspension spring mounting prescribed area is excessively corroded (2.4.a.3) 12 October 2016 [11:42] 12/10/2016 30 September 2011 [10:49] 30/09/2011 474292029416 474292029416 415923071204 415923071204
2 Nearside rear rear brake recording little or no effort (3.7.b.5a) Nearside rear rear brake recording little or no effort (3.7.b.5a) 14 October 2013 [10:47] 14/10/2013 30 September 2011 [10:49] 30/09/2011 915487383299 915487383299 415923071204 415923071204
2 Brakes imbalanced across an axle (3.7.b.5b) Brakes imbalanced across an axle (3.7.b.5b) 14 October 2013 [10:47] 14/10/2013 30 September 2011 [10:49] 30/09/2011 915487383299 915487383299 415923071204 415923071204
2 Nearside headlamp not working on dipped beam (1.7.5a) Nearside headlamp not working on dipped beam (1.7.5a) 06 October 2009 [16:06] 06/10/2009 30 June 2009 [08:58] 30/06/2009 944109479207 944109479207 203211989182 203211989182
2 Parking brake: efficiency below requirements (3.7.b.7) Parking brake: efficiency below requirements (3.7.b.7) 30 June 2009 [08:58] 30/06/2009 21 November 2008 [14:27] 21/11/2008 203211989182 203211989182 373716428377 373716428377
1 Nearside seat belt anchorage prescribed area is excessively corroded inner sill to floor (5.2.6) Nearside seat belt anchorage prescribed area is excessively corroded inner sill to floor (5.2.6) 12 October 2016 [11:42] 12/10/2016 474292029416 474292029416
1 Offside rear suspension spring mounting prescribed area is excessively corroded (2.4.a.3) Offside rear suspension spring mounting prescribed area is excessively corroded (2.4.a.3) 12 October 2016 [11:42] 12/10/2016 474292029416 474292029416
1 Offside rear suspension spring mounting prescribed area is excessively corroded inner wheel arch (2.4.a.3) Offside rear suspension spring mounting prescribed area is excessively corroded inner wheel arch (2.4.a.3) 12 October 2016 [11:42] 12/10/2016 474292029416 474292029416
1 Nearside rear suspension spring mounting prescribed area is excessively corroded inner wheel arch (2.4.a.3) Nearside rear suspension spring mounting prescribed area is excessively corroded inner wheel arch (2.4.a.3) 12 October 2016 [11:42] 12/10/2016 474292029416 474292029416
1 Nearside front seat belt anchorage prescribed area is excessively corroded (5.2.6) Nearside front seat belt anchorage prescribed area is excessively corroded (5.2.6) 03 October 2014 [09:56] 03/10/2014 369526274415 369526274415
1 Nearside front front wheel bearing has excessive play (2.5.a.3c) Nearside front front wheel bearing has excessive play (2.5.a.3c) 14 October 2013 [10:47] 14/10/2013 915487383299 915487383299
1 Parking brake: efficiency below requirements (3.7.d.4) Parking brake: efficiency below requirements (3.7.d.4) 14 October 2013 [10:47] 14/10/2013 915487383299 915487383299
1 Rear registration plate lamp not working (1.1.c.1d) Rear registration plate lamp not working (1.1.c.1d) 30 September 2011 [10:49] 30/09/2011 415923071204 415923071204
1 Nearside rear registration plate lamp not working (1.1.c.1d) Nearside rear registration plate lamp not working (1.1.c.1d) 06 October 2009 [16:06] 06/10/2009 944109479207 944109479207
1 Offside track rod end ball joint has excessive play (2.2.b.1f) Offside track rod end ball joint has excessive play (2.2.b.1f) 06 October 2009 [16:06] 06/10/2009 944109479207 944109479207
1 Rear stop lamp not working (1.2.1b) Rear stop lamp not working (1.2.1b) 30 June 2009 [08:58] 30/06/2009 203211989182 203211989182
1 Nearside inner front vehicle structure has excessive corrosion, seriously affecting its strength within 30cm of the body mountings (6.1.b.2) Nearside inner front vehicle structure has excessive corrosion, seriously affecting its strength within 30cm of the body mountings (6.1.b.2) 30 June 2009 [08:58] 30/06/2009 203211989182 203211989182
1 Nearside inner rear vehicle structure has excessive corrosion, seriously affecting its strength within 30cm of the body mountings (6.1.b.2) Nearside inner rear vehicle structure has excessive corrosion, seriously affecting its strength within 30cm of the body mountings (6.1.b.2) 30 June 2009 [08:58] 30/06/2009 203211989182 203211989182
1 Offside inner vehicle structure has excessive corrosion, seriously affecting its strength within 30cm of the body mountings (6.1.b.2) Offside inner vehicle structure has excessive corrosion, seriously affecting its strength within 30cm of the body mountings (6.1.b.2) 21 November 2008 [14:27] 21/11/2008 373716428377 373716428377
1 Offside outer vehicle structure has excessive corrosion, seriously affecting its strength within 30cm of the body mountings (6.1.b.2) Offside outer vehicle structure has excessive corrosion, seriously affecting its strength within 30cm of the body mountings (6.1.b.2) 21 November 2008 [14:27] 21/11/2008 373716428377 373716428377
1 Offside outer front tyre tread depth below requirements of 1.6mm (4.1.e.1) Offside outer front tyre tread depth below requirements of 1.6mm (4.1.e.1) 21 November 2008 [14:27] 21/11/2008 373716428377 373716428377
1 Nearside registration plate lamp not working (1.1.c.1d) Nearside registration plate lamp not working (1.1.c.1d) 21 November 2008 [14:27] 21/11/2008 373716428377 373716428377
1 Nearside rear leaf spring has a deteriorated shackle pin rubber bush resulting in excessive movement (2.4.b.2) Nearside rear leaf spring has a deteriorated shackle pin rubber bush resulting in excessive movement (2.4.b.2) 21 November 2007 [10:09] 21/11/2007 290885127394 290885127394
1 Offside rear leaf spring has a deteriorated shackle pin rubber bush resulting in excessive movement (2.4.b.2) Offside rear leaf spring has a deteriorated shackle pin rubber bush resulting in excessive movement (2.4.b.2) 21 November 2007 [10:09] 21/11/2007 290885127394 290885127394
1 Nearside rear braking system leaking (3.6.a.1) Nearside rear braking system leaking (3.6.a.1) 21 November 2007 [10:09] 21/11/2007 290885127394 290885127394
1 Offside rear braking system leaking (3.6.a.1) Offside rear braking system leaking (3.6.a.1) 21 November 2007 [10:09] 21/11/2007 290885127394 290885127394
1 Offside rear brake recording little or no effort (3.7.b.5a) Offside rear brake recording little or no effort (3.7.b.5a) 21 November 2007 [10:09] 21/11/2007 290885127394 290885127394
1 Offside rear parking brake recording little or no effort (3.7.b.6a) Offside rear parking brake recording little or no effort (3.7.b.6a) 21 November 2007 [10:09] 21/11/2007 290885127394 290885127394
1 Nearside front brake hose excessively chafed (3.6.b.4d) Nearside front brake hose excessively chafed (3.6.b.4d) 07 November 2006 [12:29] 07/11/2006 424461416390 424461416390
1 Nearside front shock absorber has negligible damping effect (2.7.5) Nearside front shock absorber has negligible damping effect (2.7.5) 07 November 2006 [12:29] 07/11/2006 424461416390 424461416390
1 Offside front shock absorber has negligible damping effect (2.7.5) Offside front shock absorber has negligible damping effect (2.7.5) 07 November 2006 [12:29] 07/11/2006 424461416390 424461416390

ALL 339 VHU User Entered Faults [4]

ALL User Entered faults, ORDERED by OCCURRENCE DURING 339 VHU's MOT HISTORY
ALL 339 VHU User Entered Faults [4]
ALL User Entered faults, ORDERED by OCCURRENCE DURING 339 VHU's MOT HISTORY
User Entered Faults | source www.vehiclestats.co.uk
Fault Fault Test Date Test Date/Time Reference MOT Test Reference
2 Near side front lower trunion joint has slight play Near side front lower trunion joint has slight play 15 October 2013 [14:29] 15/10/2013 14 October 2013 [10:47] 14/10/2013 458208183243 458208183243 915487383299 915487383299
2 Corrosoin on nearside inner wing Corrosoin on nearside inner wing 09 October 2009 [14:54] 09/10/2009 06 October 2009 [16:06] 06/10/2009 662112389228 662112389228 944109479207 944109479207

MOT TEST: 03 May 2018 14:20:00 PASSED
MOT TEST: 03 May 2018 14:20:00 PASSED

This test (190790208983) was completed on the 03 May 2018 14:20:00 and PASSED the requirements for a valid MOT with 0 comments.

This test (190790208983) was completed on the 03 May 2018 14:20:00 and PASSED the requirements for a valid MOT with 0 comments.

Recorded mileage: 75,345

Recorded mileage: 75,345


MOT TEST: 10 April 2017 11:10:00 PASSED
MOT TEST: 10 April 2017 11:10:00 PASSED

This test (974006997186) was completed on the 10 April 2017 11:10:00 and PASSED the requirements for a valid MOT with 1 comments.

This test (974006997186) was completed on the 10 April 2017 11:10:00 and PASSED the requirements for a valid MOT with 1 comments.

Recorded mileage: 73,553

Recorded mileage: 73,553


ADVISORY


MOT TEST: 12 October 2016 11:42:45 FAILED
MOT TEST: 12 October 2016 11:42:45 FAILED

This test (474292029416) was completed on the 12 October 2016 11:42:45 and FAILED the requirements for a valid MOT with 8 comments.

This test (474292029416) was completed on the 12 October 2016 11:42:45 and FAILED the requirements for a valid MOT with 8 comments.

Recorded mileage: 73,540

Recorded mileage: 73,540


ADVISORY

FAIL


MOT TEST: 29 September 2015 13:33:41 PASSED
MOT TEST: 29 September 2015 13:33:41 PASSED

This test (537541372133) was completed on the 29 September 2015 13:33:41 and PASSED the requirements for a valid MOT with 0 comments.

This test (537541372133) was completed on the 29 September 2015 13:33:41 and PASSED the requirements for a valid MOT with 0 comments.

Recorded mileage: 106,918

Recorded mileage: 106,918


MOT TEST: 16 October 2014 12:16:17 PASSED
MOT TEST: 16 October 2014 12:16:17 PASSED

This test (108369584213) was completed on the 16 October 2014 12:16:17 and PASSED the requirements for a valid MOT with 0 comments.

This test (108369584213) was completed on the 16 October 2014 12:16:17 and PASSED the requirements for a valid MOT with 0 comments.

Recorded mileage: 93,561

Recorded mileage: 93,561


MOT TEST: 03 October 2014 09:56:33 FAILED
MOT TEST: 03 October 2014 09:56:33 FAILED

This test (369526274415) was completed on the 03 October 2014 09:56:33 and FAILED the requirements for a valid MOT with 1 comments.

This test (369526274415) was completed on the 03 October 2014 09:56:33 and FAILED the requirements for a valid MOT with 1 comments.

Recorded mileage: 9,342

Recorded mileage: 9,342


FAIL


MOT TEST: 15 October 2013 14:29:10 PASSED
MOT TEST: 15 October 2013 14:29:10 PASSED

This test (458208183243) was completed on the 15 October 2013 14:29:10 and PASSED the requirements for a valid MOT with 1 comments.

This test (458208183243) was completed on the 15 October 2013 14:29:10 and PASSED the requirements for a valid MOT with 1 comments.

Recorded mileage: 7,505

Recorded mileage: 7,505


USER ENTERED


MOT TEST: 14 October 2013 10:47:55 FAILED
MOT TEST: 14 October 2013 10:47:55 FAILED

This test (915487383299) was completed on the 14 October 2013 10:47:55 and FAILED the requirements for a valid MOT with 6 comments.

This test (915487383299) was completed on the 14 October 2013 10:47:55 and FAILED the requirements for a valid MOT with 6 comments.

Recorded mileage: 7,500

Recorded mileage: 7,500


FAIL

USER ENTERED


MOT TEST: 04 October 2012 11:42:52 PASSED
MOT TEST: 04 October 2012 11:42:52 PASSED

This test (515908072272) was completed on the 04 October 2012 11:42:52 and PASSED the requirements for a valid MOT with 0 comments.

This test (515908072272) was completed on the 04 October 2012 11:42:52 and PASSED the requirements for a valid MOT with 0 comments.

Recorded mileage: 6,349

Recorded mileage: 6,349


MOT TEST: 04 October 2011 14:53:42 PASSED
MOT TEST: 04 October 2011 14:53:42 PASSED

This test (495737771284) was completed on the 04 October 2011 14:53:42 and PASSED the requirements for a valid MOT with 0 comments.

This test (495737771284) was completed on the 04 October 2011 14:53:42 and PASSED the requirements for a valid MOT with 0 comments.

Recorded mileage: 4,567

Recorded mileage: 4,567


MOT TEST: 30 September 2011 10:49:51 FAILED
MOT TEST: 30 September 2011 10:49:51 FAILED

This test (415923071204) was completed on the 30 September 2011 10:49:51 and FAILED the requirements for a valid MOT with 6 comments.

This test (415923071204) was completed on the 30 September 2011 10:49:51 and FAILED the requirements for a valid MOT with 6 comments.

Recorded mileage: 4,561

Recorded mileage: 4,561


FAIL


MOT TEST: 23 September 2010 09:53:46 PASSED
MOT TEST: 23 September 2010 09:53:46 PASSED

This test (491046260271) was completed on the 23 September 2010 09:53:46 and PASSED the requirements for a valid MOT with 0 comments.

This test (491046260271) was completed on the 23 September 2010 09:53:46 and PASSED the requirements for a valid MOT with 0 comments.

Recorded mileage: 2,155

Recorded mileage: 2,155


MOT TEST: 09 October 2009 14:54:50 PASSED
MOT TEST: 09 October 2009 14:54:50 PASSED

This test (662112389228) was completed on the 09 October 2009 14:54:50 and PASSED the requirements for a valid MOT with 1 comments.

This test (662112389228) was completed on the 09 October 2009 14:54:50 and PASSED the requirements for a valid MOT with 1 comments.

Recorded mileage: 9,327

Recorded mileage: 9,327


USER ENTERED


MOT TEST: 06 October 2009 16:06:59 FAILED
MOT TEST: 06 October 2009 16:06:59 FAILED

This test (944109479207) was completed on the 06 October 2009 16:06:59 and FAILED the requirements for a valid MOT with 4 comments.

This test (944109479207) was completed on the 06 October 2009 16:06:59 and FAILED the requirements for a valid MOT with 4 comments.

Recorded mileage: 9,319

Recorded mileage: 9,319


FAIL

USER ENTERED


MOT TEST: 30 June 2009 08:58:59 FAILED
MOT TEST: 30 June 2009 08:58:59 FAILED

This test (203211989182) was completed on the 30 June 2009 08:58:59 and FAILED the requirements for a valid MOT with 6 comments.

This test (203211989182) was completed on the 30 June 2009 08:58:59 and FAILED the requirements for a valid MOT with 6 comments.

Recorded mileage: 8,990

Recorded mileage: 8,990


FAIL


MOT TEST: 27 November 2008 10:43:39 PASSED
MOT TEST: 27 November 2008 10:43:39 PASSED

This test (484392338321) was completed on the 27 November 2008 10:43:39 and PASSED the requirements for a valid MOT with 0 comments.

This test (484392338321) was completed on the 27 November 2008 10:43:39 and PASSED the requirements for a valid MOT with 0 comments.

Recorded mileage: 7,217

Recorded mileage: 7,217


MOT TEST: 21 November 2008 14:27:28 FAILED
MOT TEST: 21 November 2008 14:27:28 FAILED

This test (373716428377) was completed on the 21 November 2008 14:27:28 and FAILED the requirements for a valid MOT with 6 comments.

This test (373716428377) was completed on the 21 November 2008 14:27:28 and FAILED the requirements for a valid MOT with 6 comments.

Recorded mileage: 7,217

Recorded mileage: 7,217


FAIL


MOT TEST: 21 November 2007 15:10:52 PASSED
MOT TEST: 21 November 2007 15:10:52 PASSED

This test (281545927379) was completed on the 21 November 2007 15:10:52 and PASSED the requirements for a valid MOT with 1 comments.

This test (281545927379) was completed on the 21 November 2007 15:10:52 and PASSED the requirements for a valid MOT with 1 comments.

Recorded mileage: 36,512

Recorded mileage: 36,512


ADVISORY


MOT TEST: 21 November 2007 10:09:13 FAILED
MOT TEST: 21 November 2007 10:09:13 FAILED

This test (290885127394) was completed on the 21 November 2007 10:09:13 and FAILED the requirements for a valid MOT with 8 comments.

This test (290885127394) was completed on the 21 November 2007 10:09:13 and FAILED the requirements for a valid MOT with 8 comments.

Recorded mileage: 36,512

Recorded mileage: 36,512


ADVISORY

FAIL


MOT TEST: 08 November 2006 10:25:52 PASSED
MOT TEST: 08 November 2006 10:25:52 PASSED

This test (821162416337) was completed on the 08 November 2006 10:25:52 and PASSED the requirements for a valid MOT with 1 comments.

This test (821162416337) was completed on the 08 November 2006 10:25:52 and PASSED the requirements for a valid MOT with 1 comments.

Recorded mileage: 29,601

Recorded mileage: 29,601


ADVISORY


MOT TEST: 07 November 2006 12:29:56 FAILED
MOT TEST: 07 November 2006 12:29:56 FAILED

This test (424461416390) was completed on the 07 November 2006 12:29:56 and FAILED the requirements for a valid MOT with 4 comments.

This test (424461416390) was completed on the 07 November 2006 12:29:56 and FAILED the requirements for a valid MOT with 4 comments.

Recorded mileage: 29,601

Recorded mileage: 29,601


ADVISORY

FAIL


MOT TEST: 01 February 2006 14:57:39 PASSED
MOT TEST: 01 February 2006 14:57:39 PASSED

This test (190192336420) was completed on the 01 February 2006 14:57:39 and PASSED the requirements for a valid MOT with 0 comments.

This test (190192336420) was completed on the 01 February 2006 14:57:39 and PASSED the requirements for a valid MOT with 0 comments.

Recorded mileage: 25,319

Recorded mileage: 25,319