343 BPE


343BPE is registered to a Black 1956, Morris Minor with a Petrol engine. It Failed its most recent MOT Test on the 28 July 2012

9 unique faults (9 Total) reported in its MOT History (8 Tests).

0 common/recurring faults.

50% (4) MOT Pass Rate and a 50% (4) MOT Failure Rate.

44,058 recorded miles.

343 BPE


343BPE is registered to a Black 1956, Morris Minor with a Petrol engine. It Failed its most recent MOT Test on the 28 July 2012

9 unique faults (9 Total) reported in its MOT History (8 Tests).

0 common/recurring faults.

50% (4) MOT Pass Rate and a 50% (4) MOT Failure Rate.

44,058 recorded miles.

MOT PASS/Failure rate for 343 BPE

all MOT test results for 343 BPE represented as a percentage
MOT PASS/Failure rate for 343 BPE
all MOT test results for 343 BPE represented as a percentage

PERCENTAGE OF VEHICLE FAULTS WITH 343 BPE

ALL REPORTED FAULTS, DISPLAYED BY PERCENTAGE OF OCCURRENCE DURING ALL MOT TESTS
PERCENTAGE OF VEHICLE FAULTS WITH 343 BPE
ALL REPORTED FAULTS, DISPLAYED BY PERCENTAGE OF OCCURRENCE DURING ALL MOT TESTS
FAIL

USER ENTERED

343 BPE annual Faults by type

ALL REPORTED FAULTS, DISPLAYED over time and categorised by type
343 BPE annual Faults by type
ALL REPORTED FAULTS, DISPLAYED over time and categorised by type

ALL 343 BPE Failure Faults [8]

ALL Failure faults, ORDERED by OCCURRENCE DURING 343 BPE's MOT HISTORY
ALL 343 BPE Failure Faults [8]
ALL Failure faults, ORDERED by OCCURRENCE DURING 343 BPE's MOT HISTORY
Fail Faults | source www.vehiclestats.co.uk
Fault Fault Test Date Test Date/Time Reference MOT Test Reference
1 Offside outer upper front suspension has excessive movement at a wishbone pin or bush (2.5.a.1c) Offside outer upper front suspension has excessive movement at a wishbone pin or bush (2.5.a.1c) 25 July 2012 [09:53] 25/07/2012 627177102216 627177102216
1 Fuel cap/sealing device sealing washer deteriorated (7.2.4c) Fuel cap/sealing device sealing washer deteriorated (7.2.4c) 28 July 2011 [17:27] 28/07/2011 328959101495 328959101495
1 Nearside headlamp not working on dipped beam (1.7.5a) Nearside headlamp not working on dipped beam (1.7.5a) 20 July 2010 [10:16] 20/07/2010 361781500481 361781500481
1 Semaphore indicator switch faulty (1.4.c.1c) Semaphore indicator switch faulty (1.4.c.1c) 20 July 2010 [10:16] 20/07/2010 361781500481 361781500481
1 Offside front brake binding (3.7.b.1) Offside front brake binding (3.7.b.1) 18 July 2009 [12:46] 18/07/2009 834609799102 834609799102
1 Nearside rear brake recording little or no effort (3.7.b.5a) Nearside rear brake recording little or no effort (3.7.b.5a) 18 July 2009 [12:46] 18/07/2009 834609799102 834609799102
1 Nearside rear parking brake recording little or no effort (3.7.b.6a) Nearside rear parking brake recording little or no effort (3.7.b.6a) 18 July 2009 [12:46] 18/07/2009 834609799102 834609799102
1 Parking brake: efficiency below requirements (3.7.b.7) Parking brake: efficiency below requirements (3.7.b.7) 18 July 2009 [12:46] 18/07/2009 834609799102 834609799102

ALL 343 BPE User Entered Faults [1]

ALL User Entered faults, ORDERED by OCCURRENCE DURING 343 BPE's MOT HISTORY
ALL 343 BPE User Entered Faults [1]
ALL User Entered faults, ORDERED by OCCURRENCE DURING 343 BPE's MOT HISTORY
Fail Faults | source www.vehiclestats.co.uk
Fault Fault Test Date Test Date/Time Reference MOT Test Reference
1 Fuel cap cannot be removed . Fuel cap cannot be removed . 20 July 2010 [10:16] 20/07/2010 361781500481 361781500481

MOT TEST: 28 July 2012 10:14:42 PASSED
MOT TEST: 28 July 2012 10:14:42 PASSED

This test (826510412245) was completed on the 28 July 2012 10:14:42 and PASSED the requirements for a valid MOT with 0 comments.

This test (826510412245) was completed on the 28 July 2012 10:14:42 and PASSED the requirements for a valid MOT with 0 comments.

Recorded mileage: 44,058

Recorded mileage: 44,058


MOT TEST: 25 July 2012 09:53:34 FAILED
MOT TEST: 25 July 2012 09:53:34 FAILED

This test (627177102216) was completed on the 25 July 2012 09:53:34 and FAILED the requirements for a valid MOT with 1 comments.

This test (627177102216) was completed on the 25 July 2012 09:53:34 and FAILED the requirements for a valid MOT with 1 comments.

Recorded mileage: 44,050

Recorded mileage: 44,050


FAIL


MOT TEST: 29 July 2011 08:12:19 PASSED
MOT TEST: 29 July 2011 08:12:19 PASSED

This test (139930211267) was completed on the 29 July 2011 08:12:19 and PASSED the requirements for a valid MOT with 0 comments.

This test (139930211267) was completed on the 29 July 2011 08:12:19 and PASSED the requirements for a valid MOT with 0 comments.

Recorded mileage: 38,958

Recorded mileage: 38,958


MOT TEST: 28 July 2011 17:27:37 FAILED
MOT TEST: 28 July 2011 17:27:37 FAILED

This test (328959101495) was completed on the 28 July 2011 17:27:37 and FAILED the requirements for a valid MOT with 1 comments.

This test (328959101495) was completed on the 28 July 2011 17:27:37 and FAILED the requirements for a valid MOT with 1 comments.

Recorded mileage: 38,958

Recorded mileage: 38,958


FAIL


MOT TEST: 27 July 2010 17:34:46 PASSED
MOT TEST: 27 July 2010 17:34:46 PASSED

This test (613328400218) was completed on the 27 July 2010 17:34:46 and PASSED the requirements for a valid MOT with 0 comments.

This test (613328400218) was completed on the 27 July 2010 17:34:46 and PASSED the requirements for a valid MOT with 0 comments.

Recorded mileage: 37,254

Recorded mileage: 37,254


MOT TEST: 20 July 2010 10:16:43 FAILED
MOT TEST: 20 July 2010 10:16:43 FAILED

This test (361781500481) was completed on the 20 July 2010 10:16:43 and FAILED the requirements for a valid MOT with 3 comments.

This test (361781500481) was completed on the 20 July 2010 10:16:43 and FAILED the requirements for a valid MOT with 3 comments.

Recorded mileage: 37,264

Recorded mileage: 37,264


FAIL

USER ENTERED


MOT TEST: 24 July 2009 10:27:06 PASSED
MOT TEST: 24 July 2009 10:27:06 PASSED

This test (313915709268) was completed on the 24 July 2009 10:27:06 and PASSED the requirements for a valid MOT with 0 comments.

This test (313915709268) was completed on the 24 July 2009 10:27:06 and PASSED the requirements for a valid MOT with 0 comments.

Recorded mileage: 37,264

Recorded mileage: 37,264


MOT TEST: 18 July 2009 12:46:47 FAILED
MOT TEST: 18 July 2009 12:46:47 FAILED

This test (834609799102) was completed on the 18 July 2009 12:46:47 and FAILED the requirements for a valid MOT with 4 comments.

This test (834609799102) was completed on the 18 July 2009 12:46:47 and FAILED the requirements for a valid MOT with 4 comments.

Recorded mileage: 37,264

Recorded mileage: 37,264


FAIL