344 YUM


344YUM is registered to a Black 1962, Morris Minor with a Petrol engine. It Failed its most recent MOT Test on the 20 March 2012

1 unique faults (1 Total) reported in its MOT History (3 Tests).

0 common/recurring faults.

67% (2) MOT Pass Rate and a 33% (1) MOT Failure Rate.

65,447 recorded miles.

344 YUM


344YUM is registered to a Black 1962, Morris Minor with a Petrol engine. It Failed its most recent MOT Test on the 20 March 2012

1 unique faults (1 Total) reported in its MOT History (3 Tests).

0 common/recurring faults.

67% (2) MOT Pass Rate and a 33% (1) MOT Failure Rate.

65,447 recorded miles.

MOT PASS/Failure rate for 344 YUM

all MOT test results for 344 YUM represented as a percentage
MOT PASS/Failure rate for 344 YUM
all MOT test results for 344 YUM represented as a percentage

PERCENTAGE OF VEHICLE FAULTS WITH 344 YUM

ALL REPORTED FAULTS, DISPLAYED BY PERCENTAGE OF OCCURRENCE DURING ALL MOT TESTS
PERCENTAGE OF VEHICLE FAULTS WITH 344 YUM
ALL REPORTED FAULTS, DISPLAYED BY PERCENTAGE OF OCCURRENCE DURING ALL MOT TESTS
PASS WITH RECTIFICATION

344 YUM annual Faults by type

ALL REPORTED FAULTS, DISPLAYED over time and categorised by type
344 YUM annual Faults by type
ALL REPORTED FAULTS, DISPLAYED over time and categorised by type

ALL 344 YUM Pass With Rectification Faults [1]

ALL Pass With Rectification faults, ORDERED by OCCURRENCE DURING 344 YUM's MOT HISTORY
ALL 344 YUM Pass With Rectification Faults [1]
ALL Pass With Rectification faults, ORDERED by OCCURRENCE DURING 344 YUM's MOT HISTORY
Pass With Rectification Faults | source www.vehiclestats.co.uk
Fault Fault Test Date Test Date/Time Reference MOT Test Reference
1 Registration plate lamp not working (1.1.c.1d) Registration plate lamp not working (1.1.c.1d) 20 March 2012 [09:55] 20/03/2012 596030782015 596030782015

MOT TEST: 20 March 2012 09:55:03 PASSED
MOT TEST: 20 March 2012 09:55:03 PASSED

This test (595920682020) was completed on the 20 March 2012 09:55:03 and PASSED the requirements for a valid MOT with 0 comments.

This test (595920682020) was completed on the 20 March 2012 09:55:03 and PASSED the requirements for a valid MOT with 0 comments.

Recorded mileage: 65,447

Recorded mileage: 65,447


MOT TEST: 20 March 2012 09:55:03 FAILED
MOT TEST: 20 March 2012 09:55:03 FAILED

This test (596030782015) was completed on the 20 March 2012 09:55:03 and FAILED the requirements for a valid MOT with 1 comments.

This test (596030782015) was completed on the 20 March 2012 09:55:03 and FAILED the requirements for a valid MOT with 1 comments.

Recorded mileage: 65,447

Recorded mileage: 65,447


PASS WITH RECTIFICATION


MOT TEST: 18 April 2011 14:18:53 PASSED
MOT TEST: 18 April 2011 14:18:53 PASSED

This test (785178501107) was completed on the 18 April 2011 14:18:53 and PASSED the requirements for a valid MOT with 0 comments.

This test (785178501107) was completed on the 18 April 2011 14:18:53 and PASSED the requirements for a valid MOT with 0 comments.

Recorded mileage: 63,923

Recorded mileage: 63,923