3527H


3527H is registered to a Black 1953, Morris Minor with a Petrol engine. It Failed its most recent MOT Test on the 11 October 2007

8 unique faults (11 Total) reported in its MOT History (4 Tests).

0 common/recurring faults.

50% (2) MOT Pass Rate and a 50% (2) MOT Failure Rate.

516 recorded miles.

3527H


3527H is registered to a Black 1953, Morris Minor with a Petrol engine. It Failed its most recent MOT Test on the 11 October 2007

8 unique faults (11 Total) reported in its MOT History (4 Tests).

0 common/recurring faults.

50% (2) MOT Pass Rate and a 50% (2) MOT Failure Rate.

516 recorded miles.

MOT PASS/Failure rate for 3527H

all MOT test results for 3527H represented as a percentage
MOT PASS/Failure rate for 3527H
all MOT test results for 3527H represented as a percentage

PERCENTAGE OF VEHICLE FAULTS WITH 3527H

ALL REPORTED FAULTS, DISPLAYED BY PERCENTAGE OF OCCURRENCE DURING ALL MOT TESTS
PERCENTAGE OF VEHICLE FAULTS WITH 3527H
ALL REPORTED FAULTS, DISPLAYED BY PERCENTAGE OF OCCURRENCE DURING ALL MOT TESTS
FAIL

USER ENTERED

3527H annual Faults by type

ALL REPORTED FAULTS, DISPLAYED over time and categorised by type
3527H annual Faults by type
ALL REPORTED FAULTS, DISPLAYED over time and categorised by type

ALL 3527H Failure Faults [10]

ALL Failure faults, ORDERED by OCCURRENCE DURING 3527H's MOT HISTORY
ALL 3527H Failure Faults [10]
ALL Failure faults, ORDERED by OCCURRENCE DURING 3527H's MOT HISTORY
Fail Faults | source www.vehiclestats.co.uk
Fault Fault Test Date Test Date/Time Reference MOT Test Reference
1 Nearside semaphore indicator arm does not extend smoothly (1.4.c.1a) Nearside semaphore indicator arm does not extend smoothly (1.4.c.1a) 11 October 2007 [12:44] 11/10/2007 340764287290 340764287290
1 Nearside rear suspension spring mounting prescribed area is excessively corroded (2.4.a.3) Nearside rear suspension spring mounting prescribed area is excessively corroded (2.4.a.3) 11 October 2007 [12:44] 11/10/2007 340764287290 340764287290
1 Offside rear suspension spring mounting prescribed area is excessively corroded (2.4.a.3) Offside rear suspension spring mounting prescribed area is excessively corroded (2.4.a.3) 11 October 2007 [12:44] 11/10/2007 340764287290 340764287290
1 Nearside rear brake binding (3.7.b.1) Nearside rear brake binding (3.7.b.1) 11 October 2007 [12:44] 11/10/2007 340764287290 340764287290
1 Offside rear suspension component mounting prescribed area is excessively corroded (2.4.a.3) Offside rear suspension component mounting prescribed area is excessively corroded (2.4.a.3) 22 October 2005 [11:36] 22/10/2005 250935195296 250935195296
1 Nearside vehicle structure has excessive corrosion, seriously affecting its strength within 30cm of the body mountings (6.1.b.2) Nearside vehicle structure has excessive corrosion, seriously affecting its strength within 30cm of the body mountings (6.1.b.2) 22 October 2005 [11:36] 22/10/2005 250935195296 250935195296
1 Offside front suspension arm attachment bracket/mounting insecure (2.4.g.1) Offside front suspension arm attachment bracket/mounting insecure (2.4.g.1) 22 October 2005 [11:36] 22/10/2005 250935195296 250935195296

ALL 3527H User Entered Faults [1]

ALL User Entered faults, ORDERED by OCCURRENCE DURING 3527H's MOT HISTORY
ALL 3527H User Entered Faults [1]
ALL User Entered faults, ORDERED by OCCURRENCE DURING 3527H's MOT HISTORY
User Entered Faults | source www.vehiclestats.co.uk
Fault Fault Test Date Test Date/Time Reference MOT Test Reference
1 Off side front and near side rear shock absorbers have a slight weep. †off side front wheel bearing has slight play Off side front and near side rear shock absorbers have a slight weep. †off side front wheel bearing has slight play 23 October 2006 [11:00] 23/10/2006 532736096249 532736096249

MOT TEST: 11 October 2007 12:44:43 FAILED
MOT TEST: 11 October 2007 12:44:43 FAILED

This test (340764287290) was completed on the 11 October 2007 12:44:43 and FAILED the requirements for a valid MOT with 7 comments.

This test (340764287290) was completed on the 11 October 2007 12:44:43 and FAILED the requirements for a valid MOT with 7 comments.

Recorded mileage: 516

Recorded mileage: 516


FAIL


MOT TEST: 23 October 2006 11:00:06 PASSED
MOT TEST: 23 October 2006 11:00:06 PASSED

This test (532736096249) was completed on the 23 October 2006 11:00:06 and PASSED the requirements for a valid MOT with 1 comments.

This test (532736096249) was completed on the 23 October 2006 11:00:06 and PASSED the requirements for a valid MOT with 1 comments.

Recorded mileage: 516

Recorded mileage: 516


USER ENTERED


MOT TEST: 31 October 2005 16:58:38 PASSED
MOT TEST: 31 October 2005 16:58:38 PASSED

This test (484304005349) was completed on the 31 October 2005 16:58:38 and PASSED the requirements for a valid MOT with 0 comments.

This test (484304005349) was completed on the 31 October 2005 16:58:38 and PASSED the requirements for a valid MOT with 0 comments.

Recorded mileage: 516

Recorded mileage: 516


MOT TEST: 22 October 2005 11:36:55 FAILED
MOT TEST: 22 October 2005 11:36:55 FAILED

This test (250935195296) was completed on the 22 October 2005 11:36:55 and FAILED the requirements for a valid MOT with 3 comments.

This test (250935195296) was completed on the 22 October 2005 11:36:55 and FAILED the requirements for a valid MOT with 3 comments.

Recorded mileage: 516

Recorded mileage: 516


FAIL