352 AAY


352AAY is registered to a Green 1962, Morris Minor with a Petrol engine. It Passed its most recent MOT Test on the 06 July 2018

23 unique faults (28 Total) reported in its MOT History (15 Tests).

5 common/recurring faults, the most frequent (2 times) is: Brake pipe slightly corroded across front (3.6.B.2c).

87% (13) MOT Pass Rate and a 13% (2) MOT Failure Rate.

58,349 recorded miles.

352 AAY


352AAY is registered to a Green 1962, Morris Minor with a Petrol engine. It Passed its most recent MOT Test on the 06 July 2018

23 unique faults (28 Total) reported in its MOT History (15 Tests).

5 common/recurring faults, the most frequent (2 times) is: Brake pipe slightly corroded across front (3.6.B.2c).

87% (13) MOT Pass Rate and a 13% (2) MOT Failure Rate.

58,349 recorded miles.

MOT PASS/Failure rate for 352 AAY

all MOT test results for 352 AAY represented as a percentage
MOT PASS/Failure rate for 352 AAY
all MOT test results for 352 AAY represented as a percentage

PERCENTAGE OF VEHICLE FAULTS WITH 352 AAY

ALL REPORTED FAULTS, DISPLAYED BY PERCENTAGE OF OCCURRENCE DURING ALL MOT TESTS
PERCENTAGE OF VEHICLE FAULTS WITH 352 AAY
ALL REPORTED FAULTS, DISPLAYED BY PERCENTAGE OF OCCURRENCE DURING ALL MOT TESTS
ADVISORY

FAIL

USER ENTERED

352 AAY annual Faults by type

ALL REPORTED FAULTS, DISPLAYED over time and categorised by type
352 AAY annual Faults by type
ALL REPORTED FAULTS, DISPLAYED over time and categorised by type

RECURRING FAULTS WITH 352 AAY

FAULTS THAT HAVE OCCURED MORE THAN ONCE DURING 352 AAY's MOT HISTORY
RECURRING FAULTS WITH 352 AAY
FAULTS THAT HAVE OCCURED MORE THAN ONCE DURING 352 AAY's MOT HISTORY
Fault Fault Test Date Test Date/Time Reference MOT Test Reference
2 Brake pipe slightly corroded across front (3.6.b.2c) Brake pipe slightly corroded across front (3.6.b.2c) 05 July 2017 [10:54] 05/07/2017 11 July 2016 [13:59] 11/07/2016 731746809393 731746809393 562839253416 562839253416
2 Slight play in o/s lower trunnion Slight play in o/s lower trunnion 11 July 2016 [13:59] 11/07/2016 13 July 2015 [11:09] 13/07/2015 562839253416 562839253416 998354995171 998354995171
2 Slight play in ends of steering rack Slight play in ends of steering rack 11 July 2016 [13:59] 11/07/2016 13 July 2015 [11:09] 13/07/2015 562839253416 562839253416 998354995171 998354995171
2 Play in steering rack inner joint(s) Play in steering rack inner joint(s) 14 July 2014 [13:56] 14/07/2014 14 July 2014 [12:12] 14/07/2014 676975794150 676975794150 658665894120 658665894120
2 Nearside front steering system has slight free play detected at steering wheel (2.2.a.1b) Nearside front steering system has slight free play detected at steering wheel (2.2.a.1b) 12 July 2013 [11:10] 12/07/2013 08 July 2013 [10:09] 08/07/2013 299383693440 299383693440 906169683141 906169683141

ALL 352 AAY ADVISORIES [15]

ALL ADVISORIES, ORDERED by OCCURRENCE DURING 352 AAY's MOT HISTORY
ALL 352 AAY ADVISORIES [15]
ALL ADVISORIES, ORDERED by OCCURRENCE DURING 352 AAY's MOT HISTORY
Advisory Faults | source www.vehiclestats.co.uk
Fault Fault Test Date Test Date/Time Reference MOT Test Reference
2 Brake pipe slightly corroded across front (3.6.b.2c) Brake pipe slightly corroded across front (3.6.b.2c) 05 July 2017 [10:54] 05/07/2017 11 July 2016 [13:59] 11/07/2016 731746809393 731746809393 562839253416 562839253416
2 Nearside front steering system has slight free play detected at steering wheel (2.2.a.1b) Nearside front steering system has slight free play detected at steering wheel (2.2.a.1b) 12 July 2013 [11:10] 12/07/2013 08 July 2013 [10:09] 08/07/2013 299383693440 299383693440 906169683141 906169683141
1 Slight wear in o/s lower trunnion Slight wear in o/s lower trunnion 06 July 2018 [12:38] 06/07/2018 385196202013 385196202013
1 Slight wear in n/s end of steering rack Slight wear in n/s end of steering rack 06 July 2018 [12:38] 06/07/2018 385196202013 385196202013
1 Some corrosion on underside Some corrosion on underside 06 July 2018 [12:38] 06/07/2018 385196202013 385196202013
1 Play in steering rack inner joint(s) both sides () Play in steering rack inner joint(s) both sides () 05 July 2017 [10:54] 05/07/2017 731746809393 731746809393
1 Offside front lower trunnion slight play Offside front lower trunnion slight play 05 July 2017 [10:54] 05/07/2017 731746809393 731746809393
1 Nearside suspension spring mounting prescribed area is corroded but not considered excessive (2.4.a.3) Nearside suspension spring mounting prescribed area is corroded but not considered excessive (2.4.a.3) 05 July 2017 [10:54] 05/07/2017 731746809393 731746809393
1 Slight binding of o/s rear brake Slight binding of o/s rear brake 05 July 2017 [10:54] 05/07/2017 731746809393 731746809393
1 Slight play in o/s lower trunnion Slight play in o/s lower trunnion 11 July 2016 [13:59] 11/07/2016 562839253416 562839253416
1 Slight play in ends of steering rack Slight play in ends of steering rack 11 July 2016 [13:59] 11/07/2016 562839253416 562839253416
1 Brake pipe slightly corroded (3.6.b.2c) Brake pipe slightly corroded (3.6.b.2c) 13 July 2015 [11:09] 13/07/2015 998354995171 998354995171
1 Steering system has slight free play detected at steering wheel (2.2.a.1b) Steering system has slight free play detected at steering wheel (2.2.a.1b) 29 June 2006 [15:04] 29/06/2006 873980386192 873980386192

ALL 352 AAY Failure Faults [9]

ALL Failure faults, ORDERED by OCCURRENCE DURING 352 AAY's MOT HISTORY
ALL 352 AAY Failure Faults [9]
ALL Failure faults, ORDERED by OCCURRENCE DURING 352 AAY's MOT HISTORY
Fail Faults | source www.vehiclestats.co.uk
Fault Fault Test Date Test Date/Time Reference MOT Test Reference
1 Nearside front tyre tread depth below requirements of 1.6mm (4.1.e.1) Nearside front tyre tread depth below requirements of 1.6mm (4.1.e.1) 14 July 2014 [12:12] 14/07/2014 658665894120 658665894120
1 Nearside rear leaf spring shackle bracket loose (2.4.b.6a) Nearside rear leaf spring shackle bracket loose (2.4.b.6a) 14 July 2014 [12:12] 14/07/2014 658665894120 658665894120
1 Nearside front headlamp not working on dipped beam (1.7.5a) Nearside front headlamp not working on dipped beam (1.7.5a) 08 July 2013 [10:09] 08/07/2013 906169683141 906169683141
1 Offside front headlamp not working on main beam (1.7.5a) Offside front headlamp not working on main beam (1.7.5a) 08 July 2013 [10:09] 08/07/2013 906169683141 906169683141
1 Offside front braking system leaking (3.6.a.1) Offside front braking system leaking (3.6.a.1) 08 July 2013 [10:09] 08/07/2013 906169683141 906169683141
1 Front windscreen washer provides insufficient washer liquid (8.2.3) Front windscreen washer provides insufficient washer liquid (8.2.3) 08 July 2013 [10:09] 08/07/2013 906169683141 906169683141
1 Front brake application uneven (3.7.b.2) Front brake application uneven (3.7.b.2) 08 July 2013 [10:09] 08/07/2013 906169683141 906169683141
1 Offside front brake recording little or no effort (3.7.b.5a) Offside front brake recording little or no effort (3.7.b.5a) 08 July 2013 [10:09] 08/07/2013 906169683141 906169683141
1 Horn not loud enough to be heard by another road user (1.6.2b) Horn not loud enough to be heard by another road user (1.6.2b) 08 July 2013 [10:09] 08/07/2013 906169683141 906169683141

ALL 352 AAY User Entered Faults [4]

ALL User Entered faults, ORDERED by OCCURRENCE DURING 352 AAY's MOT HISTORY
ALL 352 AAY User Entered Faults [4]
ALL User Entered faults, ORDERED by OCCURRENCE DURING 352 AAY's MOT HISTORY
User Entered Faults | source www.vehiclestats.co.uk
Fault Fault Test Date Test Date/Time Reference MOT Test Reference
2 Play in steering rack inner joint(s) Play in steering rack inner joint(s) 14 July 2014 [13:56] 14/07/2014 14 July 2014 [12:12] 14/07/2014 676975794150 676975794150 658665894120 658665894120
1 Slight play in o/s lower trunnion Slight play in o/s lower trunnion 13 July 2015 [11:09] 13/07/2015 998354995171 998354995171
1 Slight play in ends of steering rack Slight play in ends of steering rack 13 July 2015 [11:09] 13/07/2015 998354995171 998354995171

MOT TEST: 06 July 2018 12:38:12 PASSED
MOT TEST: 06 July 2018 12:38:12 PASSED

This test (385196202013) was completed on the 06 July 2018 12:38:12 and PASSED the requirements for a valid MOT with 3 comments.

This test (385196202013) was completed on the 06 July 2018 12:38:12 and PASSED the requirements for a valid MOT with 3 comments.

Recorded mileage: 58,349

Recorded mileage: 58,349


ADVISORY


MOT TEST: 05 July 2017 10:54:28 PASSED
MOT TEST: 05 July 2017 10:54:28 PASSED

This test (731746809393) was completed on the 05 July 2017 10:54:28 and PASSED the requirements for a valid MOT with 5 comments.

This test (731746809393) was completed on the 05 July 2017 10:54:28 and PASSED the requirements for a valid MOT with 5 comments.

Recorded mileage: 57,844

Recorded mileage: 57,844


ADVISORY


MOT TEST: 11 July 2016 13:59:50 PASSED
MOT TEST: 11 July 2016 13:59:50 PASSED

This test (562839253416) was completed on the 11 July 2016 13:59:50 and PASSED the requirements for a valid MOT with 3 comments.

This test (562839253416) was completed on the 11 July 2016 13:59:50 and PASSED the requirements for a valid MOT with 3 comments.

Recorded mileage: 56,940

Recorded mileage: 56,940


ADVISORY


MOT TEST: 13 July 2015 11:09:14 PASSED
MOT TEST: 13 July 2015 11:09:14 PASSED

This test (998354995171) was completed on the 13 July 2015 11:09:14 and PASSED the requirements for a valid MOT with 3 comments.

This test (998354995171) was completed on the 13 July 2015 11:09:14 and PASSED the requirements for a valid MOT with 3 comments.

Recorded mileage: 56,063

Recorded mileage: 56,063


ADVISORY

USER ENTERED


MOT TEST: 14 July 2014 13:56:03 PASSED
MOT TEST: 14 July 2014 13:56:03 PASSED

This test (676975794150) was completed on the 14 July 2014 13:56:03 and PASSED the requirements for a valid MOT with 1 comments.

This test (676975794150) was completed on the 14 July 2014 13:56:03 and PASSED the requirements for a valid MOT with 1 comments.

Recorded mileage: 54,662

Recorded mileage: 54,662


USER ENTERED


MOT TEST: 14 July 2014 12:12:33 FAILED
MOT TEST: 14 July 2014 12:12:33 FAILED

This test (658665894120) was completed on the 14 July 2014 12:12:33 and FAILED the requirements for a valid MOT with 3 comments.

This test (658665894120) was completed on the 14 July 2014 12:12:33 and FAILED the requirements for a valid MOT with 3 comments.

Recorded mileage: 54,662

Recorded mileage: 54,662


FAIL

USER ENTERED


MOT TEST: 12 July 2013 11:10:32 PASSED
MOT TEST: 12 July 2013 11:10:32 PASSED

This test (299383693440) was completed on the 12 July 2013 11:10:32 and PASSED the requirements for a valid MOT with 1 comments.

This test (299383693440) was completed on the 12 July 2013 11:10:32 and PASSED the requirements for a valid MOT with 1 comments.

Recorded mileage: 52,139

Recorded mileage: 52,139


ADVISORY


MOT TEST: 08 July 2013 10:09:42 FAILED
MOT TEST: 08 July 2013 10:09:42 FAILED

This test (906169683141) was completed on the 08 July 2013 10:09:42 and FAILED the requirements for a valid MOT with 8 comments.

This test (906169683141) was completed on the 08 July 2013 10:09:42 and FAILED the requirements for a valid MOT with 8 comments.

Recorded mileage: 52,139

Recorded mileage: 52,139


ADVISORY

FAIL


MOT TEST: 24 July 2012 16:05:37 PASSED
MOT TEST: 24 July 2012 16:05:37 PASSED

This test (877766802209) was completed on the 24 July 2012 16:05:37 and PASSED the requirements for a valid MOT with 0 comments.

This test (877766802209) was completed on the 24 July 2012 16:05:37 and PASSED the requirements for a valid MOT with 0 comments.

Recorded mileage: 51,669

Recorded mileage: 51,669


MOT TEST: 05 July 2011 11:06:34 PASSED
MOT TEST: 05 July 2011 11:06:34 PASSED

This test (106546581129) was completed on the 05 July 2011 11:06:34 and PASSED the requirements for a valid MOT with 0 comments.

This test (106546581129) was completed on the 05 July 2011 11:06:34 and PASSED the requirements for a valid MOT with 0 comments.

Recorded mileage: 51,655

Recorded mileage: 51,655


MOT TEST: 01 July 2010 10:14:59 PASSED
MOT TEST: 01 July 2010 10:14:59 PASSED

This test (620162080193) was completed on the 01 July 2010 10:14:59 and PASSED the requirements for a valid MOT with 0 comments.

This test (620162080193) was completed on the 01 July 2010 10:14:59 and PASSED the requirements for a valid MOT with 0 comments.

Recorded mileage: 51,648

Recorded mileage: 51,648


MOT TEST: 09 July 2009 11:40:43 PASSED
MOT TEST: 09 July 2009 11:40:43 PASSED

This test (284500499483) was completed on the 09 July 2009 11:40:43 and PASSED the requirements for a valid MOT with 0 comments.

This test (284500499483) was completed on the 09 July 2009 11:40:43 and PASSED the requirements for a valid MOT with 0 comments.

Recorded mileage: 51,482

Recorded mileage: 51,482


MOT TEST: 08 July 2008 09:59:43 PASSED
MOT TEST: 08 July 2008 09:59:43 PASSED

This test (412510398188) was completed on the 08 July 2008 09:59:43 and PASSED the requirements for a valid MOT with 0 comments.

This test (412510398188) was completed on the 08 July 2008 09:59:43 and PASSED the requirements for a valid MOT with 0 comments.

Recorded mileage: 51,424

Recorded mileage: 51,424


MOT TEST: 13 July 2007 11:13:11 PASSED
MOT TEST: 13 July 2007 11:13:11 PASSED

This test (930804297123) was completed on the 13 July 2007 11:13:11 and PASSED the requirements for a valid MOT with 0 comments.

This test (930804297123) was completed on the 13 July 2007 11:13:11 and PASSED the requirements for a valid MOT with 0 comments.

Recorded mileage: 51,415

Recorded mileage: 51,415


MOT TEST: 29 June 2006 15:04:35 PASSED
MOT TEST: 29 June 2006 15:04:35 PASSED

This test (873980386192) was completed on the 29 June 2006 15:04:35 and PASSED the requirements for a valid MOT with 1 comments.

This test (873980386192) was completed on the 29 June 2006 15:04:35 and PASSED the requirements for a valid MOT with 1 comments.

Recorded mileage: 51,411

Recorded mileage: 51,411


ADVISORY