352 VKL


352VKL is registered to a Grey 1962, Morris Minor with a Petrol engine. It Passed its most recent MOT Test on the 10 October 2018

64 unique faults (77 Total) reported in its MOT History (24 Tests).

12 common/recurring faults, the most frequent (4 times) is: battery insecure.

46% (11) MOT Pass Rate and a 54% (13) MOT Failure Rate.

87,456 recorded miles.

352 VKL


352VKL is registered to a Grey 1962, Morris Minor with a Petrol engine. It Passed its most recent MOT Test on the 10 October 2018

64 unique faults (77 Total) reported in its MOT History (24 Tests).

12 common/recurring faults, the most frequent (4 times) is: battery insecure.

46% (11) MOT Pass Rate and a 54% (13) MOT Failure Rate.

87,456 recorded miles.

MOT PASS/Failure rate for 352 VKL

all MOT test results for 352 VKL represented as a percentage
MOT PASS/Failure rate for 352 VKL
all MOT test results for 352 VKL represented as a percentage

PERCENTAGE OF VEHICLE FAULTS WITH 352 VKL

ALL REPORTED FAULTS, DISPLAYED BY PERCENTAGE OF OCCURRENCE DURING ALL MOT TESTS
PERCENTAGE OF VEHICLE FAULTS WITH 352 VKL
ALL REPORTED FAULTS, DISPLAYED BY PERCENTAGE OF OCCURRENCE DURING ALL MOT TESTS
ADVISORY

FAIL

USER ENTERED

352 VKL annual Faults by type

ALL REPORTED FAULTS, DISPLAYED over time and categorised by type
352 VKL annual Faults by type
ALL REPORTED FAULTS, DISPLAYED over time and categorised by type

RECURRING FAULTS WITH 352 VKL

FAULTS THAT HAVE OCCURED MORE THAN ONCE DURING 352 VKL's MOT HISTORY
RECURRING FAULTS WITH 352 VKL
FAULTS THAT HAVE OCCURED MORE THAN ONCE DURING 352 VKL's MOT HISTORY
Fault Fault Test Date Test Date/Time Reference MOT Test Reference
4 Battery insecure Battery insecure 28 May 2012 [11:25] 28/05/2012 15 May 2012 [15:36] 15/05/2012 20 May 2011 [07:56] 20/05/2011 13 May 2011 [14:50] 13/05/2011 147209842177 147209842177 348096532178 348096532178 937790841172 937790841172 349193331107 349193331107
4 Battery insecure Battery insecure 28 May 2012 [11:25] 28/05/2012 15 May 2012 [15:36] 15/05/2012 20 May 2011 [07:56] 20/05/2011 13 May 2011 [14:50] 13/05/2011 147209842177 147209842177 348096532178 348096532178 937790841172 937790841172 349193331107 349193331107
2 Offside rear road wheel with a slightly distorted bead rim (4.2.a.1a) Offside rear road wheel with a slightly distorted bead rim (4.2.a.1a) 12 October 2017 [09:06] 12/10/2017 04 October 2017 [12:22] 04/10/2017 520254482413 520254482413 430865772154 430865772154
2 Nearside steering rack gaiter split (2.2.d.2d) Nearside steering rack gaiter split (2.2.d.2d) 04 October 2017 [12:22] 04/10/2017 06 October 2014 [14:20] 06/10/2014 430865772154 430865772154 909659474221 909659474221
2 Registration plate lamp not working (1.1.c.1d) Registration plate lamp not working (1.1.c.1d) 03 October 2016 [10:30] 03/10/2016 13 May 2011 [14:50] 13/05/2011 198452135374 198452135374 349193331107 349193331107
2 Windscreen washer provides insufficient washer liquid (8.2.3) Windscreen washer provides insufficient washer liquid (8.2.3) 03 October 2016 [10:30] 03/10/2016 13 May 2011 [14:50] 13/05/2011 198452135374 198452135374 349193331107 349193331107
2 Brakes imbalanced across an axle (3.7.b.5b) Brakes imbalanced across an axle (3.7.b.5b) 03 October 2015 [09:16] 03/10/2015 08 April 2010 [16:38] 08/04/2010 205718005969 205718005969 430298990019 430298990019
2 Offside rear suspension spring mounting prescribed area is excessively corroded (2.4.a.3) Offside rear suspension spring mounting prescribed area is excessively corroded (2.4.a.3) 06 October 2014 [14:20] 06/10/2014 20 May 2013 [17:01] 20/05/2013 909659474221 909659474221 856140843162 856140843162
2 Exhaust system corroded Exhaust system corroded 28 May 2012 [11:25] 28/05/2012 15 May 2012 [15:36] 15/05/2012 147209842177 147209842177 348096532178 348096532178
2 Exhaust has part of the system slightly deteriorated (7.1.1a) Exhaust has part of the system slightly deteriorated (7.1.1a) 20 May 2011 [07:56] 20/05/2011 13 May 2011 [14:50] 13/05/2011 937790841172 937790841172 349193331107 349193331107
2 Nearside rear vehicle structure has slight corrosion (6.1.a.1) Nearside rear vehicle structure has slight corrosion (6.1.a.1) 20 May 2011 [07:56] 20/05/2011 13 May 2011 [14:50] 13/05/2011 937790841172 937790841172 349193331107 349193331107
2 Nearside outer track rod end joint cover split/missing Nearside outer track rod end joint cover split/missing 20 May 2011 [07:56] 20/05/2011 13 May 2011 [14:50] 13/05/2011 937790841172 937790841172 349193331107 349193331107

ALL 352 VKL ADVISORIES [12]

ALL ADVISORIES, ORDERED by OCCURRENCE DURING 352 VKL's MOT HISTORY
ALL 352 VKL ADVISORIES [12]
ALL ADVISORIES, ORDERED by OCCURRENCE DURING 352 VKL's MOT HISTORY
Advisory Faults | source www.vehiclestats.co.uk
Fault Fault Test Date Test Date/Time Reference MOT Test Reference
2 Offside rear road wheel with a slightly distorted bead rim (4.2.a.1a) Offside rear road wheel with a slightly distorted bead rim (4.2.a.1a) 12 October 2017 [09:06] 12/10/2017 04 October 2017 [12:22] 04/10/2017 520254482413 520254482413 430865772154 430865772154
2 Exhaust has part of the system slightly deteriorated (7.1.1a) Exhaust has part of the system slightly deteriorated (7.1.1a) 20 May 2011 [07:56] 20/05/2011 13 May 2011 [14:50] 13/05/2011 937790841172 937790841172 349193331107 349193331107
2 Nearside rear vehicle structure has slight corrosion (6.1.a.1) Nearside rear vehicle structure has slight corrosion (6.1.a.1) 20 May 2011 [07:56] 20/05/2011 13 May 2011 [14:50] 13/05/2011 937790841172 937790841172 349193331107 349193331107
1 Parking brake lever has little reserve travel (3.1.6b) Parking brake lever has little reserve travel (3.1.6b) 12 October 2017 [09:06] 12/10/2017 520254482413 520254482413
1 Offside rear non obligatory seat belt missing Offside rear non obligatory seat belt missing 12 October 2017 [09:06] 12/10/2017 520254482413 520254482413
1 Nearside headlamp deteriorated but light output not reduced (1.7.5a) Nearside headlamp deteriorated but light output not reduced (1.7.5a) 04 October 2017 [12:22] 04/10/2017 430865772154 430865772154
1 Offside headlamp deteriorated but light output not reduced (1.7.5a) Offside headlamp deteriorated but light output not reduced (1.7.5a) 04 October 2017 [12:22] 04/10/2017 430865772154 430865772154
1 Brakes imbalanced requirements only just met. It would appear that the braking system requires adjustment or repair. (3.7.b.5b) Brakes imbalanced requirements only just met. It would appear that the braking system requires adjustment or repair. (3.7.b.5b) 15 May 2012 [15:36] 15/05/2012 348096532178 348096532178
1 Nearside track rod end ball joint has slight play (2.2.b.1f) Nearside track rod end ball joint has slight play (2.2.b.1f) 03 July 2007 [16:07] 03/07/2007 653574987169 653574987169

ALL 352 VKL Failure Faults [54]

ALL Failure faults, ORDERED by OCCURRENCE DURING 352 VKL's MOT HISTORY
ALL 352 VKL Failure Faults [54]
ALL Failure faults, ORDERED by OCCURRENCE DURING 352 VKL's MOT HISTORY
Fail Faults | source www.vehiclestats.co.uk
Fault Fault Test Date Test Date/Time Reference MOT Test Reference
2 Nearside steering rack gaiter split (2.2.d.2d) Nearside steering rack gaiter split (2.2.d.2d) 04 October 2017 [12:22] 04/10/2017 06 October 2014 [14:20] 06/10/2014 430865772154 430865772154 909659474221 909659474221
2 Registration plate lamp not working (1.1.c.1d) Registration plate lamp not working (1.1.c.1d) 03 October 2016 [10:30] 03/10/2016 13 May 2011 [14:50] 13/05/2011 198452135374 198452135374 349193331107 349193331107
2 Windscreen washer provides insufficient washer liquid (8.2.3) Windscreen washer provides insufficient washer liquid (8.2.3) 03 October 2016 [10:30] 03/10/2016 13 May 2011 [14:50] 13/05/2011 198452135374 198452135374 349193331107 349193331107
2 Brakes imbalanced across an axle (3.7.b.5b) Brakes imbalanced across an axle (3.7.b.5b) 03 October 2015 [09:16] 03/10/2015 08 April 2010 [16:38] 08/04/2010 205718005969 205718005969 430298990019 430298990019
2 Offside rear suspension spring mounting prescribed area is excessively corroded (2.4.a.3) Offside rear suspension spring mounting prescribed area is excessively corroded (2.4.a.3) 06 October 2014 [14:20] 06/10/2014 20 May 2013 [17:01] 20/05/2013 909659474221 909659474221 856140843162 856140843162
1 Windscreen washer not working (3.5 (a)) Windscreen washer not working (3.5 (a)) 09 October 2018 [15:07] 09/10/2018 422451412036 422451412036
1 Parking brake lever has no reserve travel (3.1.6b) Parking brake lever has no reserve travel (3.1.6b) 04 October 2017 [12:22] 04/10/2017 430865772154 430865772154
1 Nearside front position lamp(s) excessively deteriorated so that it is not visible from a reasonable distance (1.1.a.3d) Nearside front position lamp(s) excessively deteriorated so that it is not visible from a reasonable distance (1.1.a.3d) 04 October 2017 [12:22] 04/10/2017 430865772154 430865772154
1 Offside registration plate lamp not illuminating the registration plate (1.1.c.1e) Offside registration plate lamp not illuminating the registration plate (1.1.c.1e) 04 October 2017 [12:22] 04/10/2017 430865772154 430865772154
1 Nearside windscreen wiper not operating automatically when switched on (8.2.1b) Nearside windscreen wiper not operating automatically when switched on (8.2.1b) 04 October 2017 [12:22] 04/10/2017 430865772154 430865772154
1 Offside windscreen wiper not operating automatically when switched on (8.2.1b) Offside windscreen wiper not operating automatically when switched on (8.2.1b) 04 October 2017 [12:22] 04/10/2017 430865772154 430865772154
1 Nearside windscreen washer provides insufficient washer liquid (8.2.3) Nearside windscreen washer provides insufficient washer liquid (8.2.3) 04 October 2017 [12:22] 04/10/2017 430865772154 430865772154
1 Offside windscreen washer provides insufficient washer liquid (8.2.3) Offside windscreen washer provides insufficient washer liquid (8.2.3) 04 October 2017 [12:22] 04/10/2017 430865772154 430865772154
1 Offside rear seat belt anchorage prescribed area is excessively corroded in boot area (5.2.6) Offside rear seat belt anchorage prescribed area is excessively corroded in boot area (5.2.6) 04 October 2017 [12:22] 04/10/2017 430865772154 430865772154
1 Nearside rear suspension component mounting prescribed area is excessively corroded shackle bracket area (2.4.a.3) Nearside rear suspension component mounting prescribed area is excessively corroded shackle bracket area (2.4.a.3) 04 October 2017 [12:22] 04/10/2017 430865772154 430865772154
1 Front electrical wiring deteriorated and bare connector exposed under dashboard (1.9.2c) Front electrical wiring deteriorated and bare connector exposed under dashboard (1.9.2c) 04 October 2017 [12:22] 04/10/2017 430865772154 430865772154
1 Nearside front electrical wiring damaged, likely to cause a short engine bay (1.9.2b) Nearside front electrical wiring damaged, likely to cause a short engine bay (1.9.2b) 04 October 2017 [12:22] 04/10/2017 430865772154 430865772154
1 Speedometer cannot be illuminated. (6.7.3) Speedometer cannot be illuminated. (6.7.3) 04 October 2017 [12:22] 04/10/2017 430865772154 430865772154
1 Offside rear wheel bearing rough when rotated (2.6.1) Offside rear wheel bearing rough when rotated (2.6.1) 04 October 2017 [12:22] 04/10/2017 430865772154 430865772154
1 Offside headlamp aim too far to the left (1.8) Offside headlamp aim too far to the left (1.8) 04 October 2017 [12:22] 04/10/2017 430865772154 430865772154
1 Nearside headlamp aim too high (1.8) Nearside headlamp aim too high (1.8) 04 October 2017 [12:22] 04/10/2017 430865772154 430865772154
1 Front brakes imbalanced across an axle (3.7.b.5b) Front brakes imbalanced across an axle (3.7.b.5b) 03 October 2016 [10:30] 03/10/2016 198452135374 198452135374
1 Nearside rear suspension arm ball joint dust cover excessively deteriorated so that it no longer prevents the ingress of dirt lower trunion (2.4.g.2) Nearside rear suspension arm ball joint dust cover excessively deteriorated so that it no longer prevents the ingress of dirt lower trunion (2.4.g.2) 03 October 2016 [10:30] 03/10/2016 198452135374 198452135374
1 Parking brake: efficiency below requirements (3.7.b.7) Parking brake: efficiency below requirements (3.7.b.7) 03 October 2015 [09:16] 03/10/2015 205718005969 205718005969
1 Rear brakes imbalanced across an axle axle 2 (3.7.b.5b) Rear brakes imbalanced across an axle axle 2 (3.7.b.5b) 03 October 2015 [09:16] 03/10/2015 205718005969 205718005969
1 Windscreen wiper does not clear the windscreen effectively (8.2.2) Windscreen wiper does not clear the windscreen effectively (8.2.2) 06 October 2014 [14:20] 06/10/2014 909659474221 909659474221
1 Front registration plate deteriorated (6.3.1d) Front registration plate deteriorated (6.3.1d) 20 May 2013 [17:01] 20/05/2013 856140843162 856140843162
1 Rear registration plate deteriorated (6.3.1d) Rear registration plate deteriorated (6.3.1d) 20 May 2013 [17:01] 20/05/2013 856140843162 856140843162
1 Battery insecure (1.9.1) Battery insecure (1.9.1) 20 May 2013 [17:01] 20/05/2013 856140843162 856140843162
1 Offside suspension component mounting prescribed area is excessively corroded (2.4.a.3) Offside suspension component mounting prescribed area is excessively corroded (2.4.a.3) 20 May 2013 [17:01] 20/05/2013 856140843162 856140843162
1 Nearside rear suspension spring mounting prescribed area is excessively corroded (2.4.a.3) Nearside rear suspension spring mounting prescribed area is excessively corroded (2.4.a.3) 20 May 2013 [17:01] 20/05/2013 856140843162 856140843162
1 Offside front tyre has a lump, caused by separation or partial failure of its structure (4.1.d.1b) Offside front tyre has a lump, caused by separation or partial failure of its structure (4.1.d.1b) 20 May 2013 [17:01] 20/05/2013 856140843162 856140843162
1 Nearside track rod end ball joint dust cover excessively deteriorated so that it no longer prevents the ingress of dirt (2.2.c.1c) Nearside track rod end ball joint dust cover excessively deteriorated so that it no longer prevents the ingress of dirt (2.2.c.1c) 15 May 2012 [15:36] 15/05/2012 348096532178 348096532178
1 Body has a projection caused by corrosion (6.1.c.1) Body has a projection caused by corrosion (6.1.c.1) 15 May 2012 [15:36] 15/05/2012 348096532178 348096532178
1 Front exhaust has a major leak of exhaust gases (7.1.2) Front exhaust has a major leak of exhaust gases (7.1.2) 13 May 2011 [14:50] 13/05/2011 349193331107 349193331107
1 Front body has a sharp edge caused by corrosion (6.1.c.1) Front body has a sharp edge caused by corrosion (6.1.c.1) 13 May 2011 [14:50] 13/05/2011 349193331107 349193331107
1 Offside front suspension component mounting prescribed area is excessively corroded (2.4.a.3) Offside front suspension component mounting prescribed area is excessively corroded (2.4.a.3) 08 April 2010 [16:38] 08/04/2010 430298990019 430298990019
1 Front brake application uneven (3.7.b.2) Front brake application uneven (3.7.b.2) 08 April 2010 [16:38] 08/04/2010 430298990019 430298990019
1 Offside registration plate lamp not working (1.1.5c) Offside registration plate lamp not working (1.1.5c) 14 April 2009 [15:30] 14/04/2009 384754009129 384754009129
1 Offside front brake master cylinder/servo mounting prescribed area is excessively corroded (3.6.c.3) Offside front brake master cylinder/servo mounting prescribed area is excessively corroded (3.6.c.3) 14 April 2009 [15:30] 14/04/2009 384754009129 384754009129
1 Nearside front suspension component mounting prescribed area is excessively corroded (2.4.a.3) Nearside front suspension component mounting prescribed area is excessively corroded (2.4.a.3) 14 April 2009 [15:30] 14/04/2009 384754009129 384754009129
1 Nearside headlamp insecure (1.7.3) Nearside headlamp insecure (1.7.3) 19 December 2007 [09:03] 19/12/2007 841093457300 841093457300
1 Horn control missing (1.6.1) Horn control missing (1.6.1) 19 December 2007 [09:03] 19/12/2007 841093457300 841093457300
1 Offside rear body or chassis has excessive corrosion, seriously affecting its strength within 30cm of the body mountings (6.1.b.2) Offside rear body or chassis has excessive corrosion, seriously affecting its strength within 30cm of the body mountings (6.1.b.2) 03 July 2007 [16:07] 03/07/2007 653574987169 653574987169
1 Rear tyre(s) incorrect because different size tyres are fitted on the same axle. (4.1.a.1a) Rear tyre(s) incorrect because different size tyres are fitted on the same axle. (4.1.a.1a) 03 July 2007 [16:07] 03/07/2007 653574987169 653574987169
1 Nearside rear rear brake binding (3.7.b.1) Nearside rear rear brake binding (3.7.b.1) 03 July 2007 [16:07] 03/07/2007 653574987169 653574987169
1 Indicator tell tale missing (1.4.a.2a) Indicator tell tale missing (1.4.a.2a) 14 September 2005 [15:36] 14/09/2005 792787255235 792787255235
1 Front windscreen washer provides insufficient washer liquid (8.2.3) Front windscreen washer provides insufficient washer liquid (8.2.3) 14 September 2005 [15:36] 14/09/2005 792787255235 792787255235

ALL 352 VKL User Entered Faults [11]

ALL User Entered faults, ORDERED by OCCURRENCE DURING 352 VKL's MOT HISTORY
ALL 352 VKL User Entered Faults [11]
ALL User Entered faults, ORDERED by OCCURRENCE DURING 352 VKL's MOT HISTORY
User Entered Faults | source www.vehiclestats.co.uk
Fault Fault Test Date Test Date/Time Reference MOT Test Reference
4 Battery insecure Battery insecure 28 May 2012 [11:25] 28/05/2012 15 May 2012 [15:36] 15/05/2012 20 May 2011 [07:56] 20/05/2011 13 May 2011 [14:50] 13/05/2011 147209842177 147209842177 348096532178 348096532178 937790841172 937790841172 349193331107 349193331107
4 Battery insecure Battery insecure 28 May 2012 [11:25] 28/05/2012 15 May 2012 [15:36] 15/05/2012 20 May 2011 [07:56] 20/05/2011 13 May 2011 [14:50] 13/05/2011 147209842177 147209842177 348096532178 348096532178 937790841172 937790841172 349193331107 349193331107
2 Exhaust system corroded Exhaust system corroded 28 May 2012 [11:25] 28/05/2012 15 May 2012 [15:36] 15/05/2012 147209842177 147209842177 348096532178 348096532178
2 Nearside outer track rod end joint cover split/missing Nearside outer track rod end joint cover split/missing 20 May 2011 [07:56] 20/05/2011 13 May 2011 [14:50] 13/05/2011 937790841172 937790841172 349193331107 349193331107
1 Play in steering rack inner joint(s) Play in steering rack inner joint(s) 20 May 2013 [17:01] 20/05/2013 856140843162 856140843162
1 Both front doors corroded and holed Both front doors corroded and holed 20 May 2013 [17:01] 20/05/2013 856140843162 856140843162
1 Offside rear wing corroded and holed Offside rear wing corroded and holed 20 May 2013 [17:01] 20/05/2013 856140843162 856140843162

MOT TEST: 10 October 2018 11:55:43 PASSED
MOT TEST: 10 October 2018 11:55:43 PASSED

This test (433780161401) was completed on the 10 October 2018 11:55:43 and PASSED the requirements for a valid MOT with 0 comments.

This test (433780161401) was completed on the 10 October 2018 11:55:43 and PASSED the requirements for a valid MOT with 0 comments.

Recorded mileage: 87,456

Recorded mileage: 87,456


MOT TEST: 09 October 2018 15:07:29 FAILED
MOT TEST: 09 October 2018 15:07:29 FAILED

This test (422451412036) was completed on the 09 October 2018 15:07:29 and FAILED the requirements for a valid MOT with 1 comments.

This test (422451412036) was completed on the 09 October 2018 15:07:29 and FAILED the requirements for a valid MOT with 1 comments.

Recorded mileage: 87,456

Recorded mileage: 87,456


FAIL


MOT TEST: 12 October 2017 09:06:02 PASSED
MOT TEST: 12 October 2017 09:06:02 PASSED

This test (520254482413) was completed on the 12 October 2017 09:06:02 and PASSED the requirements for a valid MOT with 3 comments.

This test (520254482413) was completed on the 12 October 2017 09:06:02 and PASSED the requirements for a valid MOT with 3 comments.

Recorded mileage: 85,484

Recorded mileage: 85,484


ADVISORY


MOT TEST: 04 October 2017 12:22:23 FAILED
MOT TEST: 04 October 2017 12:22:23 FAILED

This test (430865772154) was completed on the 04 October 2017 12:22:23 and FAILED the requirements for a valid MOT with 19 comments.

This test (430865772154) was completed on the 04 October 2017 12:22:23 and FAILED the requirements for a valid MOT with 19 comments.

Recorded mileage: 85,484

Recorded mileage: 85,484


ADVISORY

FAIL


MOT TEST: 06 October 2016 16:03:31 PASSED
MOT TEST: 06 October 2016 16:03:31 PASSED

This test (414110356373) was completed on the 06 October 2016 16:03:31 and PASSED the requirements for a valid MOT with 0 comments.

This test (414110356373) was completed on the 06 October 2016 16:03:31 and PASSED the requirements for a valid MOT with 0 comments.

Recorded mileage: 81,979

Recorded mileage: 81,979


MOT TEST: 03 October 2016 10:30:37 FAILED
MOT TEST: 03 October 2016 10:30:37 FAILED

This test (198452135374) was completed on the 03 October 2016 10:30:37 and FAILED the requirements for a valid MOT with 4 comments.

This test (198452135374) was completed on the 03 October 2016 10:30:37 and FAILED the requirements for a valid MOT with 4 comments.

Recorded mileage: 81,979

Recorded mileage: 81,979


FAIL


MOT TEST: 03 October 2015 10:52:21 PASSED
MOT TEST: 03 October 2015 10:52:21 PASSED

This test (213617540676) was completed on the 03 October 2015 10:52:21 and PASSED the requirements for a valid MOT with 0 comments.

This test (213617540676) was completed on the 03 October 2015 10:52:21 and PASSED the requirements for a valid MOT with 0 comments.

Recorded mileage: 77,557

Recorded mileage: 77,557


MOT TEST: 03 October 2015 09:16:23 FAILED
MOT TEST: 03 October 2015 09:16:23 FAILED

This test (205718005969) was completed on the 03 October 2015 09:16:23 and FAILED the requirements for a valid MOT with 3 comments.

This test (205718005969) was completed on the 03 October 2015 09:16:23 and FAILED the requirements for a valid MOT with 3 comments.

Recorded mileage: 77,557

Recorded mileage: 77,557


FAIL


MOT TEST: 07 October 2014 14:46:17 PASSED
MOT TEST: 07 October 2014 14:46:17 PASSED

This test (948510284265) was completed on the 07 October 2014 14:46:17 and PASSED the requirements for a valid MOT with 0 comments.

This test (948510284265) was completed on the 07 October 2014 14:46:17 and PASSED the requirements for a valid MOT with 0 comments.

Recorded mileage: 76,625

Recorded mileage: 76,625


MOT TEST: 06 October 2014 14:20:01 FAILED
MOT TEST: 06 October 2014 14:20:01 FAILED

This test (909659474221) was completed on the 06 October 2014 14:20:01 and FAILED the requirements for a valid MOT with 3 comments.

This test (909659474221) was completed on the 06 October 2014 14:20:01 and FAILED the requirements for a valid MOT with 3 comments.

Recorded mileage: 76,624

Recorded mileage: 76,624


FAIL


MOT TEST: 20 May 2013 17:01:00 FAILED
MOT TEST: 20 May 2013 17:01:00 FAILED

This test (856140843162) was completed on the 20 May 2013 17:01:00 and FAILED the requirements for a valid MOT with 10 comments.

This test (856140843162) was completed on the 20 May 2013 17:01:00 and FAILED the requirements for a valid MOT with 10 comments.

Recorded mileage: 76,619

Recorded mileage: 76,619


FAIL

USER ENTERED


MOT TEST: 28 May 2012 11:25:15 PASSED
MOT TEST: 28 May 2012 11:25:15 PASSED

This test (147209842177) was completed on the 28 May 2012 11:25:15 and PASSED the requirements for a valid MOT with 2 comments.

This test (147209842177) was completed on the 28 May 2012 11:25:15 and PASSED the requirements for a valid MOT with 2 comments.

Recorded mileage: 76,441

Recorded mileage: 76,441


USER ENTERED


MOT TEST: 15 May 2012 15:36:10 FAILED
MOT TEST: 15 May 2012 15:36:10 FAILED

This test (348096532178) was completed on the 15 May 2012 15:36:10 and FAILED the requirements for a valid MOT with 5 comments.

This test (348096532178) was completed on the 15 May 2012 15:36:10 and FAILED the requirements for a valid MOT with 5 comments.

Recorded mileage: 76,441

Recorded mileage: 76,441


ADVISORY

FAIL

USER ENTERED


MOT TEST: 20 May 2011 07:56:45 PASSED
MOT TEST: 20 May 2011 07:56:45 PASSED

This test (937790841172) was completed on the 20 May 2011 07:56:45 and PASSED the requirements for a valid MOT with 4 comments.

This test (937790841172) was completed on the 20 May 2011 07:56:45 and PASSED the requirements for a valid MOT with 4 comments.

Recorded mileage: 76,247

Recorded mileage: 76,247


ADVISORY

USER ENTERED


MOT TEST: 13 May 2011 14:50:46 FAILED
MOT TEST: 13 May 2011 14:50:46 FAILED

This test (349193331107) was completed on the 13 May 2011 14:50:46 and FAILED the requirements for a valid MOT with 8 comments.

This test (349193331107) was completed on the 13 May 2011 14:50:46 and FAILED the requirements for a valid MOT with 8 comments.

Recorded mileage: 76,247

Recorded mileage: 76,247


ADVISORY

FAIL

USER ENTERED


MOT TEST: 13 May 2010 15:15:46 PASSED
MOT TEST: 13 May 2010 15:15:46 PASSED

This test (153763530122) was completed on the 13 May 2010 15:15:46 and PASSED the requirements for a valid MOT with 0 comments.

This test (153763530122) was completed on the 13 May 2010 15:15:46 and PASSED the requirements for a valid MOT with 0 comments.

Recorded mileage: 75,803

Recorded mileage: 75,803


MOT TEST: 08 April 2010 16:38:41 FAILED
MOT TEST: 08 April 2010 16:38:41 FAILED

This test (430298990019) was completed on the 08 April 2010 16:38:41 and FAILED the requirements for a valid MOT with 3 comments.

This test (430298990019) was completed on the 08 April 2010 16:38:41 and FAILED the requirements for a valid MOT with 3 comments.

Recorded mileage: 75,718

Recorded mileage: 75,718


FAIL


MOT TEST: 20 April 2009 09:49:06 PASSED
MOT TEST: 20 April 2009 09:49:06 PASSED

This test (993810119195) was completed on the 20 April 2009 09:49:06 and PASSED the requirements for a valid MOT with 0 comments.

This test (993810119195) was completed on the 20 April 2009 09:49:06 and PASSED the requirements for a valid MOT with 0 comments.

Recorded mileage: 75,484

Recorded mileage: 75,484


MOT TEST: 14 April 2009 15:30:04 FAILED
MOT TEST: 14 April 2009 15:30:04 FAILED

This test (384754009129) was completed on the 14 April 2009 15:30:04 and FAILED the requirements for a valid MOT with 4 comments.

This test (384754009129) was completed on the 14 April 2009 15:30:04 and FAILED the requirements for a valid MOT with 4 comments.

Recorded mileage: 75,484

Recorded mileage: 75,484


FAIL


MOT TEST: 04 February 2008 15:49:17 PASSED
MOT TEST: 04 February 2008 15:49:17 PASSED

This test (200015538020) was completed on the 04 February 2008 15:49:17 and PASSED the requirements for a valid MOT with 0 comments.

This test (200015538020) was completed on the 04 February 2008 15:49:17 and PASSED the requirements for a valid MOT with 0 comments.

Recorded mileage: 75,304

Recorded mileage: 75,304


MOT TEST: 19 December 2007 09:03:51 FAILED
MOT TEST: 19 December 2007 09:03:51 FAILED

This test (841093457300) was completed on the 19 December 2007 09:03:51 and FAILED the requirements for a valid MOT with 2 comments.

This test (841093457300) was completed on the 19 December 2007 09:03:51 and FAILED the requirements for a valid MOT with 2 comments.

Recorded mileage: 75,303

Recorded mileage: 75,303


FAIL


MOT TEST: 03 July 2007 16:07:35 FAILED
MOT TEST: 03 July 2007 16:07:35 FAILED

This test (653574987169) was completed on the 03 July 2007 16:07:35 and FAILED the requirements for a valid MOT with 4 comments.

This test (653574987169) was completed on the 03 July 2007 16:07:35 and FAILED the requirements for a valid MOT with 4 comments.

Recorded mileage: 75,303

Recorded mileage: 75,303


ADVISORY

FAIL


MOT TEST: 22 September 2005 16:58:35 PASSED
MOT TEST: 22 September 2005 16:58:35 PASSED

This test (532035865258) was completed on the 22 September 2005 16:58:35 and PASSED the requirements for a valid MOT with 0 comments.

This test (532035865258) was completed on the 22 September 2005 16:58:35 and PASSED the requirements for a valid MOT with 0 comments.

Recorded mileage: 74,599

Recorded mileage: 74,599


MOT TEST: 14 September 2005 15:36:06 FAILED
MOT TEST: 14 September 2005 15:36:06 FAILED

This test (792787255235) was completed on the 14 September 2005 15:36:06 and FAILED the requirements for a valid MOT with 2 comments.

This test (792787255235) was completed on the 14 September 2005 15:36:06 and FAILED the requirements for a valid MOT with 2 comments.

Recorded mileage: 74,599

Recorded mileage: 74,599


FAIL