369 9PU


3699PU is registered to a Black 1960, Morris Minor traveller with a Petrol engine. It Failed its most recent MOT Test on the 23 August 2017

12 unique faults (14 Total) reported in its MOT History (13 Tests).

2 common/recurring faults, the most frequent (2 times) is: Nearside Headlamp not working on main beam (1.7.5a).

69% (9) MOT Pass Rate and a 31% (4) MOT Failure Rate.

30,899 recorded miles.

369 9PU


3699PU is registered to a Black 1960, Morris Minor traveller with a Petrol engine. It Failed its most recent MOT Test on the 23 August 2017

12 unique faults (14 Total) reported in its MOT History (13 Tests).

2 common/recurring faults, the most frequent (2 times) is: Nearside Headlamp not working on main beam (1.7.5a).

69% (9) MOT Pass Rate and a 31% (4) MOT Failure Rate.

30,899 recorded miles.

MOT PASS/Failure rate for 369 9PU

all MOT test results for 369 9PU represented as a percentage
MOT PASS/Failure rate for 369 9PU
all MOT test results for 369 9PU represented as a percentage

PERCENTAGE OF VEHICLE FAULTS WITH 369 9PU

ALL REPORTED FAULTS, DISPLAYED BY PERCENTAGE OF OCCURRENCE DURING ALL MOT TESTS
PERCENTAGE OF VEHICLE FAULTS WITH 369 9PU
ALL REPORTED FAULTS, DISPLAYED BY PERCENTAGE OF OCCURRENCE DURING ALL MOT TESTS
ADVISORY

FAIL

PASS WITH RECTIFICATION

369 9PU annual Faults by type

ALL REPORTED FAULTS, DISPLAYED over time and categorised by type
369 9PU annual Faults by type
ALL REPORTED FAULTS, DISPLAYED over time and categorised by type

RECURRING FAULTS WITH 369 9PU

FAULTS THAT HAVE OCCURED MORE THAN ONCE DURING 369 9PU's MOT HISTORY
RECURRING FAULTS WITH 369 9PU
FAULTS THAT HAVE OCCURED MORE THAN ONCE DURING 369 9PU's MOT HISTORY
Fault Fault Test Date Test Date/Time Reference MOT Test Reference
2 Nearside headlamp not working on main beam (1.7.5a) Nearside headlamp not working on main beam (1.7.5a) 26 July 2011 [12:38] 26/07/2011 17 August 2009 [12:53] 17/08/2009 368287601461 368287601461 344619129294 344619129294
2 Nearside front lower steering pivot point has slight play (2.2.b.1g) Nearside front lower steering pivot point has slight play (2.2.b.1g) 05 August 2010 [15:43] 05/08/2010 05 August 2010 [12:47] 05/08/2010 683207910213 683207910213 251597210284 251597210284

ALL 369 9PU ADVISORIES [2]

ALL ADVISORIES, ORDERED by OCCURRENCE DURING 369 9PU's MOT HISTORY
ALL 369 9PU ADVISORIES [2]
ALL ADVISORIES, ORDERED by OCCURRENCE DURING 369 9PU's MOT HISTORY
Advisory Faults | source www.vehiclestats.co.uk
Fault Fault Test Date Test Date/Time Reference MOT Test Reference
2 Nearside front lower steering pivot point has slight play (2.2.b.1g) Nearside front lower steering pivot point has slight play (2.2.b.1g) 05 August 2010 [15:43] 05/08/2010 05 August 2010 [12:47] 05/08/2010 683207910213 683207910213 251597210284 251597210284

ALL 369 9PU Failure Faults [11]

ALL Failure faults, ORDERED by OCCURRENCE DURING 369 9PU's MOT HISTORY
ALL 369 9PU Failure Faults [11]
ALL Failure faults, ORDERED by OCCURRENCE DURING 369 9PU's MOT HISTORY
Fail Faults | source www.vehiclestats.co.uk
Fault Fault Test Date Test Date/Time Reference MOT Test Reference
2 Nearside headlamp not working on main beam (1.7.5a) Nearside headlamp not working on main beam (1.7.5a) 26 July 2011 [12:38] 26/07/2011 17 August 2009 [12:53] 17/08/2009 368287601461 368287601461 344619129294 344619129294
1 Rear stop lamp not working (1.2.1b) Rear stop lamp not working (1.2.1b) 05 August 2010 [12:47] 05/08/2010 251597210284 251597210284
1 Nearside rear braking system leaking (3.6.a.1) Nearside rear braking system leaking (3.6.a.1) 05 August 2010 [12:47] 05/08/2010 251597210284 251597210284
1 Nearside front brake hose excessively deteriorated (3.6.b.4d) Nearside front brake hose excessively deteriorated (3.6.b.4d) 17 August 2009 [12:53] 17/08/2009 344619129294 344619129294
1 Offside rear brake hose excessively deteriorated (3.6.b.4d) Offside rear brake hose excessively deteriorated (3.6.b.4d) 17 August 2009 [12:53] 17/08/2009 344619129294 344619129294
1 Rear brake pipe inadequately clipped (3.6.b.1) Rear brake pipe inadequately clipped (3.6.b.1) 17 August 2009 [12:53] 17/08/2009 344619129294 344619129294
1 Centre exhaust has a major leak of exhaust gases (7.1.2) Centre exhaust has a major leak of exhaust gases (7.1.2) 17 August 2009 [12:53] 17/08/2009 344619129294 344619129294
1 Offside rear brake recording little or no effort (3.7.b.5a) Offside rear brake recording little or no effort (3.7.b.5a) 17 August 2009 [12:53] 17/08/2009 344619129294 344619129294
1 Offside rear parking brake recording little or no effort (3.7.b.6a) Offside rear parking brake recording little or no effort (3.7.b.6a) 17 August 2009 [12:53] 17/08/2009 344619129294 344619129294
1 Parking brake: efficiency below requirements (3.7.b.7) Parking brake: efficiency below requirements (3.7.b.7) 17 August 2009 [12:53] 17/08/2009 344619129294 344619129294

ALL 369 9PU Pass With Rectification Faults [1]

ALL Pass With Rectification faults, ORDERED by OCCURRENCE DURING 369 9PU's MOT HISTORY
ALL 369 9PU Pass With Rectification Faults [1]
ALL Pass With Rectification faults, ORDERED by OCCURRENCE DURING 369 9PU's MOT HISTORY
Pass With Rectification Faults | source www.vehiclestats.co.uk
Fault Fault Test Date Test Date/Time Reference MOT Test Reference
1 Stop lamp not working (1.2.1b) Stop lamp not working (1.2.1b) 14 August 2014 [11:21] 14/08/2014 538136724281 538136724281

MOT TEST: 23 August 2017 14:10:48 PASSED
MOT TEST: 23 August 2017 14:10:48 PASSED

This test (640468765758) was completed on the 23 August 2017 14:10:48 and PASSED the requirements for a valid MOT with 0 comments.

This test (640468765758) was completed on the 23 August 2017 14:10:48 and PASSED the requirements for a valid MOT with 0 comments.

Recorded mileage: 30,899

Recorded mileage: 30,899


MOT TEST: 12 August 2016 09:31:17 PASSED
MOT TEST: 12 August 2016 09:31:17 PASSED

This test (188187559644) was completed on the 12 August 2016 09:31:17 and PASSED the requirements for a valid MOT with 0 comments.

This test (188187559644) was completed on the 12 August 2016 09:31:17 and PASSED the requirements for a valid MOT with 0 comments.

Recorded mileage: 30,885

Recorded mileage: 30,885


MOT TEST: 12 August 2015 14:13:20 PASSED
MOT TEST: 12 August 2015 14:13:20 PASSED

This test (833677240079) was completed on the 12 August 2015 14:13:20 and PASSED the requirements for a valid MOT with 0 comments.

This test (833677240079) was completed on the 12 August 2015 14:13:20 and PASSED the requirements for a valid MOT with 0 comments.

Recorded mileage: 30,872

Recorded mileage: 30,872


MOT TEST: 14 August 2014 11:21:57 PASSED
MOT TEST: 14 August 2014 11:21:57 PASSED

This test (105476924217) was completed on the 14 August 2014 11:21:57 and PASSED the requirements for a valid MOT with 0 comments.

This test (105476924217) was completed on the 14 August 2014 11:21:57 and PASSED the requirements for a valid MOT with 0 comments.

Recorded mileage: 30,850

Recorded mileage: 30,850


MOT TEST: 14 August 2014 11:21:57 FAILED
MOT TEST: 14 August 2014 11:21:57 FAILED

This test (538136724281) was completed on the 14 August 2014 11:21:57 and FAILED the requirements for a valid MOT with 1 comments.

This test (538136724281) was completed on the 14 August 2014 11:21:57 and FAILED the requirements for a valid MOT with 1 comments.

Recorded mileage: 30,850

Recorded mileage: 30,850


PASS WITH RECTIFICATION


MOT TEST: 20 August 2013 17:17:57 PASSED
MOT TEST: 20 August 2013 17:17:57 PASSED

This test (339932033283) was completed on the 20 August 2013 17:17:57 and PASSED the requirements for a valid MOT with 0 comments.

This test (339932033283) was completed on the 20 August 2013 17:17:57 and PASSED the requirements for a valid MOT with 0 comments.

Recorded mileage: 30,836

Recorded mileage: 30,836


MOT TEST: 28 August 2012 14:45:28 PASSED
MOT TEST: 28 August 2012 14:45:28 PASSED

This test (625241842288) was completed on the 28 August 2012 14:45:28 and PASSED the requirements for a valid MOT with 0 comments.

This test (625241842288) was completed on the 28 August 2012 14:45:28 and PASSED the requirements for a valid MOT with 0 comments.

Recorded mileage: 30,818

Recorded mileage: 30,818


MOT TEST: 27 July 2011 15:07:16 PASSED
MOT TEST: 27 July 2011 15:07:16 PASSED

This test (698138101232) was completed on the 27 July 2011 15:07:16 and PASSED the requirements for a valid MOT with 0 comments.

This test (698138101232) was completed on the 27 July 2011 15:07:16 and PASSED the requirements for a valid MOT with 0 comments.

Recorded mileage: 30,808

Recorded mileage: 30,808


MOT TEST: 26 July 2011 12:38:14 FAILED
MOT TEST: 26 July 2011 12:38:14 FAILED

This test (368287601461) was completed on the 26 July 2011 12:38:14 and FAILED the requirements for a valid MOT with 1 comments.

This test (368287601461) was completed on the 26 July 2011 12:38:14 and FAILED the requirements for a valid MOT with 1 comments.

Recorded mileage: 30,795

Recorded mileage: 30,795


FAIL


MOT TEST: 05 August 2010 15:43:07 PASSED
MOT TEST: 05 August 2010 15:43:07 PASSED

This test (683207910213) was completed on the 05 August 2010 15:43:07 and PASSED the requirements for a valid MOT with 1 comments.

This test (683207910213) was completed on the 05 August 2010 15:43:07 and PASSED the requirements for a valid MOT with 1 comments.

Recorded mileage: 30,785

Recorded mileage: 30,785


ADVISORY


MOT TEST: 05 August 2010 12:47:20 FAILED
MOT TEST: 05 August 2010 12:47:20 FAILED

This test (251597210284) was completed on the 05 August 2010 12:47:20 and FAILED the requirements for a valid MOT with 3 comments.

This test (251597210284) was completed on the 05 August 2010 12:47:20 and FAILED the requirements for a valid MOT with 3 comments.

Recorded mileage: 30,774

Recorded mileage: 30,774


ADVISORY

FAIL


MOT TEST: 27 August 2009 12:35:36 PASSED
MOT TEST: 27 August 2009 12:35:36 PASSED

This test (294699539226) was completed on the 27 August 2009 12:35:36 and PASSED the requirements for a valid MOT with 0 comments.

This test (294699539226) was completed on the 27 August 2009 12:35:36 and PASSED the requirements for a valid MOT with 0 comments.

Recorded mileage: 30,715

Recorded mileage: 30,715


MOT TEST: 17 August 2009 12:53:43 FAILED
MOT TEST: 17 August 2009 12:53:43 FAILED

This test (344619129294) was completed on the 17 August 2009 12:53:43 and FAILED the requirements for a valid MOT with 8 comments.

This test (344619129294) was completed on the 17 August 2009 12:53:43 and FAILED the requirements for a valid MOT with 8 comments.

Recorded mileage: 30,704

Recorded mileage: 30,704


FAIL