374 XVW


374XVW is registered to a Grey 1961, Morris Minor with a Petrol engine. It Failed its most recent MOT Test on the 03 December 2005

12 unique faults (13 Total) reported in its MOT History (1 Tests).

0 common/recurring faults.

0% (0) MOT Pass Rate and a 100% (1) MOT Failure Rate.

7,926 recorded miles.

374 XVW


374XVW is registered to a Grey 1961, Morris Minor with a Petrol engine. It Failed its most recent MOT Test on the 03 December 2005

12 unique faults (13 Total) reported in its MOT History (1 Tests).

0 common/recurring faults.

0% (0) MOT Pass Rate and a 100% (1) MOT Failure Rate.

7,926 recorded miles.

MOT PASS/Failure rate for 374 XVW

all MOT test results for 374 XVW represented as a percentage
MOT PASS/Failure rate for 374 XVW
all MOT test results for 374 XVW represented as a percentage

PERCENTAGE OF VEHICLE FAULTS WITH 374 XVW

ALL REPORTED FAULTS, DISPLAYED BY PERCENTAGE OF OCCURRENCE DURING ALL MOT TESTS
PERCENTAGE OF VEHICLE FAULTS WITH 374 XVW
ALL REPORTED FAULTS, DISPLAYED BY PERCENTAGE OF OCCURRENCE DURING ALL MOT TESTS
FAIL

374 XVW annual Faults by type

ALL REPORTED FAULTS, DISPLAYED over time and categorised by type
374 XVW annual Faults by type
ALL REPORTED FAULTS, DISPLAYED over time and categorised by type

ALL 374 XVW Failure Faults [13]

ALL Failure faults, ORDERED by OCCURRENCE DURING 374 XVW's MOT HISTORY
ALL 374 XVW Failure Faults [13]
ALL Failure faults, ORDERED by OCCURRENCE DURING 374 XVW's MOT HISTORY
Fail Faults | source www.vehiclestats.co.uk
Fault Fault Test Date Test Date/Time Reference MOT Test Reference
1 Nearside front lower front position lamp(s) adversely affected by the operation of another lamp (1.1.a.3f) Nearside front lower front position lamp(s) adversely affected by the operation of another lamp (1.1.a.3f) 03 December 2005 [13:47] 03/12/2005 454007135393 454007135393
1 Offside front upper headlamp not working on main beam (1.7.5a) Offside front upper headlamp not working on main beam (1.7.5a) 03 December 2005 [13:47] 03/12/2005 454007135393 454007135393
1 Offside front upper headlamp does not operate immediately when selected on main beam (1.7.4a) Offside front upper headlamp does not operate immediately when selected on main beam (1.7.4a) 03 December 2005 [13:47] 03/12/2005 454007135393 454007135393
1 Nearside semaphore indicator arm does not extend smoothly (1.4.c.1a) Nearside semaphore indicator arm does not extend smoothly (1.4.c.1a) 03 December 2005 [13:47] 03/12/2005 454007135393 454007135393
1 Nearside fuel cap/sealing device sealing washer missing (7.2.4c) Nearside fuel cap/sealing device sealing washer missing (7.2.4c) 03 December 2005 [13:47] 03/12/2005 454007135393 454007135393
1 Nearside front vehicle structure has excessive corrosion, seriously affecting its strength within 30cm of the body mountings (6.1.b.2) Nearside front vehicle structure has excessive corrosion, seriously affecting its strength within 30cm of the body mountings (6.1.b.2) 03 December 2005 [13:47] 03/12/2005 454007135393 454007135393
1 Nearside rear vehicle structure has excessive corrosion, seriously affecting its strength within 30cm of the body mountings (6.1.b.2) Nearside rear vehicle structure has excessive corrosion, seriously affecting its strength within 30cm of the body mountings (6.1.b.2) 03 December 2005 [13:47] 03/12/2005 454007135393 454007135393
1 Nearside rear vehicle structure has an inadequate repair which adversely affects braking or steering (6.1.a.1) Nearside rear vehicle structure has an inadequate repair which adversely affects braking or steering (6.1.a.1) 03 December 2005 [13:47] 03/12/2005 454007135393 454007135393
1 Offside rear vehicle structure has an inadequate repair, seriously affecting its strength within 30cm of the body mountings (6.1.b.2) Offside rear vehicle structure has an inadequate repair, seriously affecting its strength within 30cm of the body mountings (6.1.b.2) 03 December 2005 [13:47] 03/12/2005 454007135393 454007135393
1 Body or chassis has excessive corrosion, seriously affecting its strength within 30cm of the body mountings (6.1.b.2) Body or chassis has excessive corrosion, seriously affecting its strength within 30cm of the body mountings (6.1.b.2) 03 December 2005 [13:47] 03/12/2005 454007135393 454007135393
1 Front brake pipe excessively corroded (3.6.b.2c) Front brake pipe excessively corroded (3.6.b.2c) 03 December 2005 [13:47] 03/12/2005 454007135393 454007135393
1 Front windscreen washer provides insufficient washer liquid (8.2.3) Front windscreen washer provides insufficient washer liquid (8.2.3) 03 December 2005 [13:47] 03/12/2005 454007135393 454007135393

MOT TEST: 03 December 2005 13:47:51 FAILED
MOT TEST: 03 December 2005 13:47:51 FAILED

This test (454007135393) was completed on the 03 December 2005 13:47:51 and FAILED the requirements for a valid MOT with 13 comments.

This test (454007135393) was completed on the 03 December 2005 13:47:51 and FAILED the requirements for a valid MOT with 13 comments.

Recorded mileage: 7,926

Recorded mileage: 7,926


FAIL