383 TNK


383TNK is registered to a Blue 1963, Morris Minor 1000 with a Petrol engine. It Passed its most recent MOT Test on the 12 April 2018

31 unique faults (49 Total) reported in its MOT History (19 Tests).

14 common/recurring faults, the most frequent (4 times) is: Offside Rear Shock absorber has a light misting of oil (2.7.3).

68% (13) MOT Pass Rate and a 32% (6) MOT Failure Rate.

38,884 recorded miles.

383 TNK


383TNK is registered to a Blue 1963, Morris Minor 1000 with a Petrol engine. It Passed its most recent MOT Test on the 12 April 2018

31 unique faults (49 Total) reported in its MOT History (19 Tests).

14 common/recurring faults, the most frequent (4 times) is: Offside Rear Shock absorber has a light misting of oil (2.7.3).

68% (13) MOT Pass Rate and a 32% (6) MOT Failure Rate.

38,884 recorded miles.

MOT PASS/Failure rate for 383 TNK

all MOT test results for 383 TNK represented as a percentage
MOT PASS/Failure rate for 383 TNK
all MOT test results for 383 TNK represented as a percentage

PERCENTAGE OF VEHICLE FAULTS WITH 383 TNK

ALL REPORTED FAULTS, DISPLAYED BY PERCENTAGE OF OCCURRENCE DURING ALL MOT TESTS
PERCENTAGE OF VEHICLE FAULTS WITH 383 TNK
ALL REPORTED FAULTS, DISPLAYED BY PERCENTAGE OF OCCURRENCE DURING ALL MOT TESTS
ADVISORY

FAIL

PASS WITH RECTIFICATION

383 TNK annual Faults by type

ALL REPORTED FAULTS, DISPLAYED over time and categorised by type
383 TNK annual Faults by type
ALL REPORTED FAULTS, DISPLAYED over time and categorised by type

RECURRING FAULTS WITH 383 TNK

FAULTS THAT HAVE OCCURED MORE THAN ONCE DURING 383 TNK's MOT HISTORY
RECURRING FAULTS WITH 383 TNK
FAULTS THAT HAVE OCCURED MORE THAN ONCE DURING 383 TNK's MOT HISTORY
Fault Fault Test Date Test Date/Time Reference MOT Test Reference
4 Offside rear shock absorber has a light misting of oil (2.7.3) Offside rear shock absorber has a light misting of oil (2.7.3) 12 April 2018 [12:28] 12/04/2018 12 April 2018 [12:28] 12/04/2018 29 April 2016 [15:57] 29/04/2016 27 April 2016 [09:35] 27/04/2016 639843970300 639843970300 845100530480 845100530480 846608425531 846608425531 948097963319 948097963319
3 Horn not working (1.6.2a) Horn not working (1.6.2a) 14 March 2013 [16:28] 14/03/2013 19 March 2009 [14:06] 19/03/2009 15 March 2008 [17:00] 15/03/2008 259363473028 259363473028 970818179095 970818179095 683165778094 683165778094
3 Service brake: efficiency below requirements (3.7.b.7) Service brake: efficiency below requirements (3.7.b.7) 14 March 2013 [16:28] 14/03/2013 19 March 2009 [14:06] 19/03/2009 15 March 2008 [17:00] 15/03/2008 259363473028 259363473028 970818179095 970818179095 683165778094 683165778094
2 Offside front lower slight lift in trunion Offside front lower slight lift in trunion 12 April 2018 [12:28] 12/04/2018 12 April 2018 [12:28] 12/04/2018 639843970300 639843970300 845100530480 845100530480
2 Boot floor corroded Boot floor corroded 12 April 2018 [12:28] 12/04/2018 12 April 2018 [12:28] 12/04/2018 639843970300 639843970300 845100530480 845100530480
2 Offside front suspension component mounting prescribed area is corroded but not considered excessive rear torsion bar (2.4.a.3) Offside front suspension component mounting prescribed area is corroded but not considered excessive rear torsion bar (2.4.a.3) 12 April 2018 [12:28] 12/04/2018 12 April 2018 [12:28] 12/04/2018 639843970300 639843970300 845100530480 845100530480
2 Offside front suspension component mounting prescribed area is corroded but not considered excessive rear torsion bar mounting (2.4.a.3) Offside front suspension component mounting prescribed area is corroded but not considered excessive rear torsion bar mounting (2.4.a.3) 12 April 2018 [12:28] 12/04/2018 12 April 2018 [12:28] 12/04/2018 639843970300 639843970300 845100530480 845100530480
2 Fuel pipe/s corroded () Fuel pipe/s corroded () 12 April 2018 [12:28] 12/04/2018 12 April 2018 [12:28] 12/04/2018 639843970300 639843970300 845100530480 845100530480
2 Nearside front lower slight lift in trunion Nearside front lower slight lift in trunion 12 April 2018 [12:28] 12/04/2018 12 April 2018 [12:28] 12/04/2018 639843970300 639843970300 845100530480 845100530480
2 Nearside track rod end ball joint dust cover deteriorated, but preventing the ingress of dirt (2.2.c.1c) Nearside track rod end ball joint dust cover deteriorated, but preventing the ingress of dirt (2.2.c.1c) 12 April 2018 [12:28] 12/04/2018 12 April 2018 [12:28] 12/04/2018 639843970300 639843970300 845100530480 845100530480
2 Offside front track rod end ball joint dust cover deteriorated, but preventing the ingress of dirt (2.2.c.1c) Offside front track rod end ball joint dust cover deteriorated, but preventing the ingress of dirt (2.2.c.1c) 12 April 2018 [12:28] 12/04/2018 12 April 2018 [12:28] 12/04/2018 639843970300 639843970300 845100530480 845100530480
2 Travel in foot brake Travel in foot brake 12 April 2018 [12:28] 12/04/2018 12 April 2018 [12:28] 12/04/2018 639843970300 639843970300 845100530480 845100530480
2 Nearside rear shock absorber has a light misting of oil (2.7.3) Nearside rear shock absorber has a light misting of oil (2.7.3) 29 April 2016 [15:57] 29/04/2016 27 April 2016 [09:35] 27/04/2016 846608425531 846608425531 948097963319 948097963319
2 Parking brake: efficiency below requirements (3.7.b.7) Parking brake: efficiency below requirements (3.7.b.7) 27 March 2014 [09:15] 27/03/2014 14 March 2013 [16:28] 14/03/2013 228436084041 228436084041 259363473028 259363473028

ALL 383 TNK ADVISORIES [25]

ALL ADVISORIES, ORDERED by OCCURRENCE DURING 383 TNK's MOT HISTORY
ALL 383 TNK ADVISORIES [25]
ALL ADVISORIES, ORDERED by OCCURRENCE DURING 383 TNK's MOT HISTORY
Advisory Faults | source www.vehiclestats.co.uk
Fault Fault Test Date Test Date/Time Reference MOT Test Reference
4 Offside rear shock absorber has a light misting of oil (2.7.3) Offside rear shock absorber has a light misting of oil (2.7.3) 12 April 2018 [12:28] 12/04/2018 12 April 2018 [12:28] 12/04/2018 29 April 2016 [15:57] 29/04/2016 27 April 2016 [09:35] 27/04/2016 639843970300 639843970300 845100530480 845100530480 846608425531 846608425531 948097963319 948097963319
2 Offside front lower slight lift in trunion Offside front lower slight lift in trunion 12 April 2018 [12:28] 12/04/2018 12 April 2018 [12:28] 12/04/2018 639843970300 639843970300 845100530480 845100530480
2 Boot floor corroded Boot floor corroded 12 April 2018 [12:28] 12/04/2018 12 April 2018 [12:28] 12/04/2018 639843970300 639843970300 845100530480 845100530480
2 Offside front suspension component mounting prescribed area is corroded but not considered excessive rear torsion bar (2.4.a.3) Offside front suspension component mounting prescribed area is corroded but not considered excessive rear torsion bar (2.4.a.3) 12 April 2018 [12:28] 12/04/2018 12 April 2018 [12:28] 12/04/2018 639843970300 639843970300 845100530480 845100530480
2 Offside front suspension component mounting prescribed area is corroded but not considered excessive rear torsion bar mounting (2.4.a.3) Offside front suspension component mounting prescribed area is corroded but not considered excessive rear torsion bar mounting (2.4.a.3) 12 April 2018 [12:28] 12/04/2018 12 April 2018 [12:28] 12/04/2018 639843970300 639843970300 845100530480 845100530480
2 Fuel pipe/s corroded () Fuel pipe/s corroded () 12 April 2018 [12:28] 12/04/2018 12 April 2018 [12:28] 12/04/2018 639843970300 639843970300 845100530480 845100530480
2 Nearside front lower slight lift in trunion Nearside front lower slight lift in trunion 12 April 2018 [12:28] 12/04/2018 12 April 2018 [12:28] 12/04/2018 639843970300 639843970300 845100530480 845100530480
2 Nearside track rod end ball joint dust cover deteriorated, but preventing the ingress of dirt (2.2.c.1c) Nearside track rod end ball joint dust cover deteriorated, but preventing the ingress of dirt (2.2.c.1c) 12 April 2018 [12:28] 12/04/2018 12 April 2018 [12:28] 12/04/2018 639843970300 639843970300 845100530480 845100530480
2 Offside front track rod end ball joint dust cover deteriorated, but preventing the ingress of dirt (2.2.c.1c) Offside front track rod end ball joint dust cover deteriorated, but preventing the ingress of dirt (2.2.c.1c) 12 April 2018 [12:28] 12/04/2018 12 April 2018 [12:28] 12/04/2018 639843970300 639843970300 845100530480 845100530480
2 Travel in foot brake Travel in foot brake 12 April 2018 [12:28] 12/04/2018 12 April 2018 [12:28] 12/04/2018 639843970300 639843970300 845100530480 845100530480
2 Nearside rear shock absorber has a light misting of oil (2.7.3) Nearside rear shock absorber has a light misting of oil (2.7.3) 29 April 2016 [15:57] 29/04/2016 27 April 2016 [09:35] 27/04/2016 846608425531 846608425531 948097963319 948097963319
1 Rear axle u bolts may be starting to work loose Rear axle u bolts may be starting to work loose 27 April 2016 [09:35] 27/04/2016 948097963319 948097963319

ALL 383 TNK Failure Faults [20]

ALL Failure faults, ORDERED by OCCURRENCE DURING 383 TNK's MOT HISTORY
ALL 383 TNK Failure Faults [20]
ALL Failure faults, ORDERED by OCCURRENCE DURING 383 TNK's MOT HISTORY
Fail Faults | source www.vehiclestats.co.uk
Fault Fault Test Date Test Date/Time Reference MOT Test Reference
3 Horn not working (1.6.2a) Horn not working (1.6.2a) 14 March 2013 [16:28] 14/03/2013 19 March 2009 [14:06] 19/03/2009 15 March 2008 [17:00] 15/03/2008 259363473028 259363473028 970818179095 970818179095 683165778094 683165778094
3 Service brake: efficiency below requirements (3.7.b.7) Service brake: efficiency below requirements (3.7.b.7) 14 March 2013 [16:28] 14/03/2013 19 March 2009 [14:06] 19/03/2009 15 March 2008 [17:00] 15/03/2008 259363473028 259363473028 970818179095 970818179095 683165778094 683165778094
2 Parking brake: efficiency below requirements (3.7.b.7) Parking brake: efficiency below requirements (3.7.b.7) 27 March 2014 [09:15] 27/03/2014 14 March 2013 [16:28] 14/03/2013 228436084041 228436084041 259363473028 259363473028
1 Rear brakes imbalanced across an axle axle 2 (3.7.b.5b) Rear brakes imbalanced across an axle axle 2 (3.7.b.5b) 27 April 2016 [09:35] 27/04/2016 948097963319 948097963319
1 Fuel cap/sealing device sealing washer missing (7.2.4c) Fuel cap/sealing device sealing washer missing (7.2.4c) 27 April 2016 [09:35] 27/04/2016 948097963319 948097963319
1 Offside windscreen washer provides insufficient washer liquid (8.2.3) Offside windscreen washer provides insufficient washer liquid (8.2.3) 27 April 2016 [09:35] 27/04/2016 948097963319 948097963319
1 Rear brake application uneven 56% (3.7.b.2) Rear brake application uneven 56% (3.7.b.2) 27 April 2016 [09:35] 27/04/2016 948097963319 948097963319
1 Offside front upper suspension arm locating pin locking device missing split pin (2.4.g.3b) Offside front upper suspension arm locating pin locking device missing split pin (2.4.g.3b) 27 April 2016 [09:35] 27/04/2016 948097963319 948097963319
1 Nearside rear brake recording little or no effort (3.7.b.5a) Nearside rear brake recording little or no effort (3.7.b.5a) 27 March 2014 [09:15] 27/03/2014 228436084041 228436084041
1 Nearside rear parking brake recording little or no effort (3.7.b.6a) Nearside rear parking brake recording little or no effort (3.7.b.6a) 27 March 2014 [09:15] 27/03/2014 228436084041 228436084041
1 Offside front position lamp(s) not working (1.1.a.3b) Offside front position lamp(s) not working (1.1.a.3b) 27 March 2014 [09:15] 27/03/2014 228436084041 228436084041
1 Brakes imbalanced across an axle (3.7.b.5b) Brakes imbalanced across an axle (3.7.b.5b) 27 March 2014 [09:15] 27/03/2014 228436084041 228436084041
1 Offside front front position lamp(s) not working (1.1.a.3b) Offside front front position lamp(s) not working (1.1.a.3b) 14 March 2013 [16:28] 14/03/2013 259363473028 259363473028
1 Rear rear brake recording little or no effort (3.7.b.5a) Rear rear brake recording little or no effort (3.7.b.5a) 14 March 2013 [16:28] 14/03/2013 259363473028 259363473028
1 Nearside rear rear parking brake recording little or no effort (3.7.b.6a) Nearside rear rear parking brake recording little or no effort (3.7.b.6a) 14 March 2013 [16:28] 14/03/2013 259363473028 259363473028

ALL 383 TNK Pass With Rectification Faults [4]

ALL Pass With Rectification faults, ORDERED by OCCURRENCE DURING 383 TNK's MOT HISTORY
ALL 383 TNK Pass With Rectification Faults [4]
ALL Pass With Rectification faults, ORDERED by OCCURRENCE DURING 383 TNK's MOT HISTORY
Advisory Faults | source www.vehiclestats.co.uk
Fault Fault Test Date Test Date/Time Reference MOT Test Reference
1 Exhaust has a major leak of exhaust gases (7.1.2) Exhaust has a major leak of exhaust gases (7.1.2) 12 April 2018 [12:28] 12/04/2018 845100530480 845100530480
1 Nearside front tyre tread depth below requirements of 1.6mm (4.1.e.1) Nearside front tyre tread depth below requirements of 1.6mm (4.1.e.1) 12 April 2018 [12:28] 12/04/2018 845100530480 845100530480
1 Offside rear brake pipe inadequately supported (3.6.b.1) Offside rear brake pipe inadequately supported (3.6.b.1) 12 April 2018 [12:28] 12/04/2018 845100530480 845100530480
1 Registration plate lamp not working (1.1.c.1d) Registration plate lamp not working (1.1.c.1d) 12 April 2018 [12:28] 12/04/2018 845100530480 845100530480

MOT TEST: 12 April 2018 12:28:29 PASSED
MOT TEST: 12 April 2018 12:28:29 PASSED

This test (639843970300) was completed on the 12 April 2018 12:28:29 and PASSED the requirements for a valid MOT with 10 comments.

This test (639843970300) was completed on the 12 April 2018 12:28:29 and PASSED the requirements for a valid MOT with 10 comments.

Recorded mileage: 10,050

Recorded mileage: 10,050


ADVISORY


MOT TEST: 12 April 2018 12:28:28 FAILED
MOT TEST: 12 April 2018 12:28:28 FAILED

This test (845100530480) was completed on the 12 April 2018 12:28:28 and FAILED the requirements for a valid MOT with 14 comments.

This test (845100530480) was completed on the 12 April 2018 12:28:28 and FAILED the requirements for a valid MOT with 14 comments.

Recorded mileage: 10,050

Recorded mileage: 10,050


ADVISORY

PASS WITH RECTIFICATION


MOT TEST: 10 April 2017 16:44:53 PASSED
MOT TEST: 10 April 2017 16:44:53 PASSED

This test (152058288829) was completed on the 10 April 2017 16:44:53 and PASSED the requirements for a valid MOT with 0 comments.

This test (152058288829) was completed on the 10 April 2017 16:44:53 and PASSED the requirements for a valid MOT with 0 comments.

Recorded mileage: 4,993

Recorded mileage: 4,993


MOT TEST: 29 April 2016 15:57:51 PASSED
MOT TEST: 29 April 2016 15:57:51 PASSED

This test (846608425531) was completed on the 29 April 2016 15:57:51 and PASSED the requirements for a valid MOT with 2 comments.

This test (846608425531) was completed on the 29 April 2016 15:57:51 and PASSED the requirements for a valid MOT with 2 comments.

Recorded mileage: 4,029

Recorded mileage: 4,029


ADVISORY


MOT TEST: 27 April 2016 09:35:57 FAILED
MOT TEST: 27 April 2016 09:35:57 FAILED

This test (948097963319) was completed on the 27 April 2016 09:35:57 and FAILED the requirements for a valid MOT with 8 comments.

This test (948097963319) was completed on the 27 April 2016 09:35:57 and FAILED the requirements for a valid MOT with 8 comments.

Recorded mileage: 4,018

Recorded mileage: 4,018


ADVISORY

FAIL


MOT TEST: 09 March 2015 16:31:24 PASSED
MOT TEST: 09 March 2015 16:31:24 PASSED

This test (495558065043) was completed on the 09 March 2015 16:31:24 and PASSED the requirements for a valid MOT with 0 comments.

This test (495558065043) was completed on the 09 March 2015 16:31:24 and PASSED the requirements for a valid MOT with 0 comments.

Recorded mileage: 3,934

Recorded mileage: 3,934


MOT TEST: 27 March 2014 13:59:34 PASSED
MOT TEST: 27 March 2014 13:59:34 PASSED

This test (815616584040) was completed on the 27 March 2014 13:59:34 and PASSED the requirements for a valid MOT with 0 comments.

This test (815616584040) was completed on the 27 March 2014 13:59:34 and PASSED the requirements for a valid MOT with 0 comments.

Recorded mileage: 38,884

Recorded mileage: 38,884


MOT TEST: 27 March 2014 09:15:15 FAILED
MOT TEST: 27 March 2014 09:15:15 FAILED

This test (228436084041) was completed on the 27 March 2014 09:15:15 and FAILED the requirements for a valid MOT with 5 comments.

This test (228436084041) was completed on the 27 March 2014 09:15:15 and FAILED the requirements for a valid MOT with 5 comments.

Recorded mileage: 38,884

Recorded mileage: 38,884


FAIL


MOT TEST: 15 March 2013 16:10:24 PASSED
MOT TEST: 15 March 2013 16:10:24 PASSED

This test (127154173078) was completed on the 15 March 2013 16:10:24 and PASSED the requirements for a valid MOT with 0 comments.

This test (127154173078) was completed on the 15 March 2013 16:10:24 and PASSED the requirements for a valid MOT with 0 comments.

Recorded mileage: 36,776

Recorded mileage: 36,776


MOT TEST: 14 March 2013 16:28:31 FAILED
MOT TEST: 14 March 2013 16:28:31 FAILED

This test (259363473028) was completed on the 14 March 2013 16:28:31 and FAILED the requirements for a valid MOT with 6 comments.

This test (259363473028) was completed on the 14 March 2013 16:28:31 and FAILED the requirements for a valid MOT with 6 comments.

Recorded mileage: 36,776

Recorded mileage: 36,776


FAIL


MOT TEST: 30 March 2012 15:53:12 PASSED
MOT TEST: 30 March 2012 15:53:12 PASSED

This test (647950292031) was completed on the 30 March 2012 15:53:12 and PASSED the requirements for a valid MOT with 0 comments.

This test (647950292031) was completed on the 30 March 2012 15:53:12 and PASSED the requirements for a valid MOT with 0 comments.

Recorded mileage: 3,605

Recorded mileage: 3,605


MOT TEST: 25 March 2011 15:07:59 PASSED
MOT TEST: 25 March 2011 15:07:59 PASSED

This test (146774081033) was completed on the 25 March 2011 15:07:59 and PASSED the requirements for a valid MOT with 0 comments.

This test (146774081033) was completed on the 25 March 2011 15:07:59 and PASSED the requirements for a valid MOT with 0 comments.

Recorded mileage: 3,531

Recorded mileage: 3,531


MOT TEST: 17 March 2010 10:44:09 PASSED
MOT TEST: 17 March 2010 10:44:09 PASSED

This test (863696070061) was completed on the 17 March 2010 10:44:09 and PASSED the requirements for a valid MOT with 0 comments.

This test (863696070061) was completed on the 17 March 2010 10:44:09 and PASSED the requirements for a valid MOT with 0 comments.

Recorded mileage: 3,406

Recorded mileage: 3,406


MOT TEST: 25 March 2009 17:01:55 PASSED
MOT TEST: 25 March 2009 17:01:55 PASSED

This test (622604789095) was completed on the 25 March 2009 17:01:55 and PASSED the requirements for a valid MOT with 0 comments.

This test (622604789095) was completed on the 25 March 2009 17:01:55 and PASSED the requirements for a valid MOT with 0 comments.

Recorded mileage: 3,245

Recorded mileage: 3,245


MOT TEST: 19 March 2009 14:06:49 FAILED
MOT TEST: 19 March 2009 14:06:49 FAILED

This test (970818179095) was completed on the 19 March 2009 14:06:49 and FAILED the requirements for a valid MOT with 2 comments.

This test (970818179095) was completed on the 19 March 2009 14:06:49 and FAILED the requirements for a valid MOT with 2 comments.

Recorded mileage: 3,239

Recorded mileage: 3,239


FAIL


MOT TEST: 17 March 2008 16:25:58 PASSED
MOT TEST: 17 March 2008 16:25:58 PASSED

This test (594517178078) was completed on the 17 March 2008 16:25:58 and PASSED the requirements for a valid MOT with 0 comments.

This test (594517178078) was completed on the 17 March 2008 16:25:58 and PASSED the requirements for a valid MOT with 0 comments.

Recorded mileage: 3,093

Recorded mileage: 3,093


MOT TEST: 15 March 2008 17:00:29 FAILED
MOT TEST: 15 March 2008 17:00:29 FAILED

This test (683165778094) was completed on the 15 March 2008 17:00:29 and FAILED the requirements for a valid MOT with 2 comments.

This test (683165778094) was completed on the 15 March 2008 17:00:29 and FAILED the requirements for a valid MOT with 2 comments.

Recorded mileage: 3,093

Recorded mileage: 3,093


FAIL


MOT TEST: 17 March 2007 09:38:56 PASSED
MOT TEST: 17 March 2007 09:38:56 PASSED

This test (520676677055) was completed on the 17 March 2007 09:38:56 and PASSED the requirements for a valid MOT with 0 comments.

This test (520676677055) was completed on the 17 March 2007 09:38:56 and PASSED the requirements for a valid MOT with 0 comments.

Recorded mileage: 2,322

Recorded mileage: 2,322


MOT TEST: 29 March 2006 16:02:54 PASSED
MOT TEST: 29 March 2006 16:02:54 PASSED

This test (660408886028) was completed on the 29 March 2006 16:02:54 and PASSED the requirements for a valid MOT with 0 comments.

This test (660408886028) was completed on the 29 March 2006 16:02:54 and PASSED the requirements for a valid MOT with 0 comments.

Recorded mileage: 2,283

Recorded mileage: 2,283