384 XUE


384XUE is registered to a Grey 1961, Morris Mino with a Petrol engine. It Failed its most recent MOT Test on the 29 July 2008

19 unique faults (19 Total) reported in its MOT History (3 Tests).

0 common/recurring faults.

33% (1) MOT Pass Rate and a 67% (2) MOT Failure Rate.

48,125 recorded miles.

384 XUE


384XUE is registered to a Grey 1961, Morris Mino with a Petrol engine. It Failed its most recent MOT Test on the 29 July 2008

19 unique faults (19 Total) reported in its MOT History (3 Tests).

0 common/recurring faults.

33% (1) MOT Pass Rate and a 67% (2) MOT Failure Rate.

48,125 recorded miles.

MOT PASS/Failure rate for 384 XUE

all MOT test results for 384 XUE represented as a percentage
MOT PASS/Failure rate for 384 XUE
all MOT test results for 384 XUE represented as a percentage

PERCENTAGE OF VEHICLE FAULTS WITH 384 XUE

ALL REPORTED FAULTS, DISPLAYED BY PERCENTAGE OF OCCURRENCE DURING ALL MOT TESTS
PERCENTAGE OF VEHICLE FAULTS WITH 384 XUE
ALL REPORTED FAULTS, DISPLAYED BY PERCENTAGE OF OCCURRENCE DURING ALL MOT TESTS
ADVISORY

FAIL

USER ENTERED

384 XUE annual Faults by type

ALL REPORTED FAULTS, DISPLAYED over time and categorised by type
384 XUE annual Faults by type
ALL REPORTED FAULTS, DISPLAYED over time and categorised by type

ALL 384 XUE ADVISORIES [5]

ALL ADVISORIES, ORDERED by OCCURRENCE DURING 384 XUE's MOT HISTORY
ALL 384 XUE ADVISORIES [5]
ALL ADVISORIES, ORDERED by OCCURRENCE DURING 384 XUE's MOT HISTORY
Fail Faults | source www.vehiclestats.co.uk
Fault Fault Test Date Test Date/Time Reference MOT Test Reference
1 Nearside front brake pipe slightly corroded (3.6.b.2c) Nearside front brake pipe slightly corroded (3.6.b.2c) 29 July 2008 [11:38] 29/07/2008 373431218228 373431218228
1 Offside front brake pipe slightly corroded (3.6.b.2c) Offside front brake pipe slightly corroded (3.6.b.2c) 29 July 2008 [11:38] 29/07/2008 373431218228 373431218228
1 Nearside front front suspension has slight play in a upper suspension ball joint (2.5.b.1a) Nearside front front suspension has slight play in a upper suspension ball joint (2.5.b.1a) 29 July 2008 [11:38] 29/07/2008 373431218228 373431218228
1 Offside front front suspension has slight play in a upper suspension ball joint (2.5.b.1a) Offside front front suspension has slight play in a upper suspension ball joint (2.5.b.1a) 29 July 2008 [11:38] 29/07/2008 373431218228 373431218228
1 Nearside rear shock absorber has a slightly worn linkage (2.7.4) Nearside rear shock absorber has a slightly worn linkage (2.7.4) 29 July 2008 [11:38] 29/07/2008 373431218228 373431218228

ALL 384 XUE Failure Faults [13]

ALL Failure faults, ORDERED by OCCURRENCE DURING 384 XUE's MOT HISTORY
ALL 384 XUE Failure Faults [13]
ALL Failure faults, ORDERED by OCCURRENCE DURING 384 XUE's MOT HISTORY
Fail Faults | source www.vehiclestats.co.uk
Fault Fault Test Date Test Date/Time Reference MOT Test Reference
1 Offside headlamp not working on main beam (1.7.5a) Offside headlamp not working on main beam (1.7.5a) 29 July 2008 [11:38] 29/07/2008 373431218228 373431218228
1 Offside registration plate lamp not working (1.1.5c) Offside registration plate lamp not working (1.1.5c) 29 July 2008 [11:38] 29/07/2008 373431218228 373431218228
1 Offside front seat belt anchorage prescribed area is excessively corroded (5.2.6) Offside front seat belt anchorage prescribed area is excessively corroded (5.2.6) 29 July 2008 [11:38] 29/07/2008 373431218228 373431218228
1 Windscreen has a combination of minor damage areas which restrict the drivers view (8.3.1c) Windscreen has a combination of minor damage areas which restrict the drivers view (8.3.1c) 03 July 2007 [15:19] 03/07/2007 294514087134 294514087134
1 Nearside headlamp aim too high (1.8) Nearside headlamp aim too high (1.8) 03 July 2007 [15:19] 03/07/2007 294514087134 294514087134
1 Offside headlamp aim too low (1.8) Offside headlamp aim too low (1.8) 03 July 2007 [15:19] 03/07/2007 294514087134 294514087134
1 Nearside rear tyre tread depth below requirements of 1.6mm (4.1.e.1) Nearside rear tyre tread depth below requirements of 1.6mm (4.1.e.1) 03 July 2007 [15:19] 03/07/2007 294514087134 294514087134
1 Offside rear tyre tread depth below requirements of 1.6mm (4.1.e.1) Offside rear tyre tread depth below requirements of 1.6mm (4.1.e.1) 03 July 2007 [15:19] 03/07/2007 294514087134 294514087134
1 Nearside rear suspension spring mounting prescribed area is excessively corroded (2.4.a.3) Nearside rear suspension spring mounting prescribed area is excessively corroded (2.4.a.3) 03 July 2007 [15:19] 03/07/2007 294514087134 294514087134
1 Offside rear suspension spring mounting prescribed area is excessively corroded (2.4.a.3) Offside rear suspension spring mounting prescribed area is excessively corroded (2.4.a.3) 03 July 2007 [15:19] 03/07/2007 294514087134 294514087134
1 Nearside front suspension component mounting prescribed area is excessively corroded (2.4.a.3) Nearside front suspension component mounting prescribed area is excessively corroded (2.4.a.3) 03 July 2007 [15:19] 03/07/2007 294514087134 294514087134
1 Nearside rear brake recording little or no effort (3.7.b.5a) Nearside rear brake recording little or no effort (3.7.b.5a) 03 July 2007 [15:19] 03/07/2007 294514087134 294514087134
1 Nearside rear parking brake recording little or no effort (3.7.b.6a) Nearside rear parking brake recording little or no effort (3.7.b.6a) 03 July 2007 [15:19] 03/07/2007 294514087134 294514087134

ALL 384 XUE User Entered Faults [1]

ALL User Entered faults, ORDERED by OCCURRENCE DURING 384 XUE's MOT HISTORY
ALL 384 XUE User Entered Faults [1]
ALL User Entered faults, ORDERED by OCCURRENCE DURING 384 XUE's MOT HISTORY
Fail Faults | source www.vehiclestats.co.uk
Fault Fault Test Date Test Date/Time Reference MOT Test Reference
1 Slight knock on steering rack Slight knock on steering rack 29 July 2008 [11:38] 29/07/2008 373431218228 373431218228

MOT TEST: 29 July 2008 11:38:26 FAILED
MOT TEST: 29 July 2008 11:38:26 FAILED

This test (373431218228) was completed on the 29 July 2008 11:38:26 and FAILED the requirements for a valid MOT with 9 comments.

This test (373431218228) was completed on the 29 July 2008 11:38:26 and FAILED the requirements for a valid MOT with 9 comments.

Recorded mileage: 48,125

Recorded mileage: 48,125


ADVISORY

FAIL

USER ENTERED


MOT TEST: 17 July 2007 10:28:59 PASSED
MOT TEST: 17 July 2007 10:28:59 PASSED

This test (373998297153) was completed on the 17 July 2007 10:28:59 and PASSED the requirements for a valid MOT with 0 comments.

This test (373998297153) was completed on the 17 July 2007 10:28:59 and PASSED the requirements for a valid MOT with 0 comments.

Recorded mileage: 46,919

Recorded mileage: 46,919


MOT TEST: 03 July 2007 15:19:44 FAILED
MOT TEST: 03 July 2007 15:19:44 FAILED

This test (294514087134) was completed on the 03 July 2007 15:19:44 and FAILED the requirements for a valid MOT with 10 comments.

This test (294514087134) was completed on the 03 July 2007 15:19:44 and FAILED the requirements for a valid MOT with 10 comments.

Recorded mileage: 46,910

Recorded mileage: 46,910


FAIL