402 GVO


402GVO is registered to a Blue 1960, Morris Minor 1000 with a Petrol engine. It Failed its most recent MOT Test on the 21 May 2015

14 unique faults (18 Total) reported in its MOT History (10 Tests).

3 common/recurring faults, the most frequent (3 times) is: Parking brake: efficiency below requirements (3.7.B.7).

50% (5) MOT Pass Rate and a 50% (5) MOT Failure Rate.

47,214 recorded miles.

402 GVO


402GVO is registered to a Blue 1960, Morris Minor 1000 with a Petrol engine. It Failed its most recent MOT Test on the 21 May 2015

14 unique faults (18 Total) reported in its MOT History (10 Tests).

3 common/recurring faults, the most frequent (3 times) is: Parking brake: efficiency below requirements (3.7.B.7).

50% (5) MOT Pass Rate and a 50% (5) MOT Failure Rate.

47,214 recorded miles.

MOT PASS/Failure rate for 402 GVO

all MOT test results for 402 GVO represented as a percentage
MOT PASS/Failure rate for 402 GVO
all MOT test results for 402 GVO represented as a percentage

PERCENTAGE OF VEHICLE FAULTS WITH 402 GVO

ALL REPORTED FAULTS, DISPLAYED BY PERCENTAGE OF OCCURRENCE DURING ALL MOT TESTS
PERCENTAGE OF VEHICLE FAULTS WITH 402 GVO
ALL REPORTED FAULTS, DISPLAYED BY PERCENTAGE OF OCCURRENCE DURING ALL MOT TESTS
ADVISORY

FAIL

402 GVO annual Faults by type

ALL REPORTED FAULTS, DISPLAYED over time and categorised by type
402 GVO annual Faults by type
ALL REPORTED FAULTS, DISPLAYED over time and categorised by type

RECURRING FAULTS WITH 402 GVO

FAULTS THAT HAVE OCCURED MORE THAN ONCE DURING 402 GVO's MOT HISTORY
RECURRING FAULTS WITH 402 GVO
FAULTS THAT HAVE OCCURED MORE THAN ONCE DURING 402 GVO's MOT HISTORY
Fault Fault Test Date Test Date/Time Reference MOT Test Reference
3 Parking brake: efficiency below requirements (3.7.b.7) Parking brake: efficiency below requirements (3.7.b.7) 07 May 2014 [10:12] 07/05/2014 12 June 2007 [10:00] 12/06/2007 06 June 2006 [11:50] 06/06/2006 435637024110 435637024110 513633867132 513633867132 272547956115 272547956115
2 Windscreen washer provides insufficient washer liquid (8.2.3) Windscreen washer provides insufficient washer liquid (8.2.3) 14 May 2015 [12:19] 14/05/2015 12 June 2007 [10:00] 12/06/2007 388964235190 388964235190 513633867132 513633867132
2 Nearside suspension component mounting prescribed area is corroded but not considered excessive (2.4.a.3) Nearside suspension component mounting prescribed area is corroded but not considered excessive (2.4.a.3) 13 June 2014 [16:36] 13/06/2014 07 May 2014 [10:12] 07/05/2014 439504764158 439504764158 435637024110 435637024110

ALL 402 GVO ADVISORIES [2]

ALL ADVISORIES, ORDERED by OCCURRENCE DURING 402 GVO's MOT HISTORY
ALL 402 GVO ADVISORIES [2]
ALL ADVISORIES, ORDERED by OCCURRENCE DURING 402 GVO's MOT HISTORY
Advisory Faults | source www.vehiclestats.co.uk
Fault Fault Test Date Test Date/Time Reference MOT Test Reference
2 Nearside suspension component mounting prescribed area is corroded but not considered excessive (2.4.a.3) Nearside suspension component mounting prescribed area is corroded but not considered excessive (2.4.a.3) 13 June 2014 [16:36] 13/06/2014 07 May 2014 [10:12] 07/05/2014 439504764158 439504764158 435637024110 435637024110

ALL 402 GVO Failure Faults [16]

ALL Failure faults, ORDERED by OCCURRENCE DURING 402 GVO's MOT HISTORY
ALL 402 GVO Failure Faults [16]
ALL Failure faults, ORDERED by OCCURRENCE DURING 402 GVO's MOT HISTORY
Fail Faults | source www.vehiclestats.co.uk
Fault Fault Test Date Test Date/Time Reference MOT Test Reference
3 Parking brake: efficiency below requirements (3.7.b.7) Parking brake: efficiency below requirements (3.7.b.7) 07 May 2014 [10:12] 07/05/2014 12 June 2007 [10:00] 12/06/2007 06 June 2006 [11:50] 06/06/2006 435637024110 435637024110 513633867132 513633867132 272547956115 272547956115
2 Windscreen washer provides insufficient washer liquid (8.2.3) Windscreen washer provides insufficient washer liquid (8.2.3) 14 May 2015 [12:19] 14/05/2015 12 June 2007 [10:00] 12/06/2007 388964235190 388964235190 513633867132 513633867132
1 Offside front position lamp(s) not working (1.1.a.3b) Offside front position lamp(s) not working (1.1.a.3b) 14 May 2015 [12:19] 14/05/2015 388964235190 388964235190
1 Registration plate lamp not working (1.1.c.1d) Registration plate lamp not working (1.1.c.1d) 14 May 2015 [12:19] 14/05/2015 388964235190 388964235190
1 Offside rear hydraulic brake cylinder leaking hydraulic fluid (3.6.a.1) Offside rear hydraulic brake cylinder leaking hydraulic fluid (3.6.a.1) 07 May 2014 [10:12] 07/05/2014 435637024110 435637024110
1 Offside front brake hose ferrule excessively corroded (3.6.b.4e) Offside front brake hose ferrule excessively corroded (3.6.b.4e) 07 May 2014 [10:12] 07/05/2014 435637024110 435637024110
1 Nearside rear brake binding (3.7.b.1) Nearside rear brake binding (3.7.b.1) 07 May 2014 [10:12] 07/05/2014 435637024110 435637024110
1 Brakes imbalanced across an axle (3.7.b.5b) Brakes imbalanced across an axle (3.7.b.5b) 07 May 2014 [10:12] 07/05/2014 435637024110 435637024110
1 Nearside front brake binding (3.7.b.1) Nearside front brake binding (3.7.b.1) 14 July 2008 [16:03] 14/07/2008 493646098168 493646098168
1 Offside rear brake binding (3.7.b.1) Offside rear brake binding (3.7.b.1) 14 July 2008 [16:03] 14/07/2008 493646098168 493646098168
1 Nearside headlamp not working on main beam (1.7.5a) Nearside headlamp not working on main beam (1.7.5a) 12 June 2007 [10:00] 12/06/2007 513633867132 513633867132
1 Offside headlamp not working on main beam (1.7.5a) Offside headlamp not working on main beam (1.7.5a) 12 June 2007 [10:00] 12/06/2007 513633867132 513633867132
1 Nearside brake clevis joint locking device missing (3.5.1l) Nearside brake clevis joint locking device missing (3.5.1l) 12 June 2007 [10:00] 12/06/2007 513633867132 513633867132

MOT TEST: 21 May 2015 12:53:44 PASSED
MOT TEST: 21 May 2015 12:53:44 PASSED

This test (517981445163) was completed on the 21 May 2015 12:53:44 and PASSED the requirements for a valid MOT with 0 comments.

This test (517981445163) was completed on the 21 May 2015 12:53:44 and PASSED the requirements for a valid MOT with 0 comments.

Recorded mileage: 47,214

Recorded mileage: 47,214


MOT TEST: 14 May 2015 12:19:46 FAILED
MOT TEST: 14 May 2015 12:19:46 FAILED

This test (388964235190) was completed on the 14 May 2015 12:19:46 and FAILED the requirements for a valid MOT with 3 comments.

This test (388964235190) was completed on the 14 May 2015 12:19:46 and FAILED the requirements for a valid MOT with 3 comments.

Recorded mileage: 47,202

Recorded mileage: 47,202


FAIL


MOT TEST: 13 June 2014 16:36:27 PASSED
MOT TEST: 13 June 2014 16:36:27 PASSED

This test (439504764158) was completed on the 13 June 2014 16:36:27 and PASSED the requirements for a valid MOT with 1 comments.

This test (439504764158) was completed on the 13 June 2014 16:36:27 and PASSED the requirements for a valid MOT with 1 comments.

Recorded mileage: 46,905

Recorded mileage: 46,905


ADVISORY


MOT TEST: 07 May 2014 10:12:47 FAILED
MOT TEST: 07 May 2014 10:12:47 FAILED

This test (435637024110) was completed on the 07 May 2014 10:12:47 and FAILED the requirements for a valid MOT with 6 comments.

This test (435637024110) was completed on the 07 May 2014 10:12:47 and FAILED the requirements for a valid MOT with 6 comments.

Recorded mileage: 46,905

Recorded mileage: 46,905


ADVISORY

FAIL


MOT TEST: 18 July 2008 16:46:01 PASSED
MOT TEST: 18 July 2008 16:46:01 PASSED

This test (380580708263) was completed on the 18 July 2008 16:46:01 and PASSED the requirements for a valid MOT with 0 comments.

This test (380580708263) was completed on the 18 July 2008 16:46:01 and PASSED the requirements for a valid MOT with 0 comments.

Recorded mileage: 46,642

Recorded mileage: 46,642


MOT TEST: 14 July 2008 16:03:52 FAILED
MOT TEST: 14 July 2008 16:03:52 FAILED

This test (493646098168) was completed on the 14 July 2008 16:03:52 and FAILED the requirements for a valid MOT with 2 comments.

This test (493646098168) was completed on the 14 July 2008 16:03:52 and FAILED the requirements for a valid MOT with 2 comments.

Recorded mileage: 46,642

Recorded mileage: 46,642


FAIL


MOT TEST: 21 June 2007 17:18:57 PASSED
MOT TEST: 21 June 2007 17:18:57 PASSED

This test (920182577144) was completed on the 21 June 2007 17:18:57 and PASSED the requirements for a valid MOT with 0 comments.

This test (920182577144) was completed on the 21 June 2007 17:18:57 and PASSED the requirements for a valid MOT with 0 comments.

Recorded mileage: 46,449

Recorded mileage: 46,449


MOT TEST: 12 June 2007 10:00:06 FAILED
MOT TEST: 12 June 2007 10:00:06 FAILED

This test (513633867132) was completed on the 12 June 2007 10:00:06 and FAILED the requirements for a valid MOT with 5 comments.

This test (513633867132) was completed on the 12 June 2007 10:00:06 and FAILED the requirements for a valid MOT with 5 comments.

Recorded mileage: 46,449

Recorded mileage: 46,449


FAIL


MOT TEST: 12 June 2006 10:51:01 PASSED
MOT TEST: 12 June 2006 10:51:01 PASSED

This test (481203966175) was completed on the 12 June 2006 10:51:01 and PASSED the requirements for a valid MOT with 0 comments.

This test (481203966175) was completed on the 12 June 2006 10:51:01 and PASSED the requirements for a valid MOT with 0 comments.

Recorded mileage: 45,921

Recorded mileage: 45,921


MOT TEST: 06 June 2006 11:50:52 FAILED
MOT TEST: 06 June 2006 11:50:52 FAILED

This test (272547956115) was completed on the 06 June 2006 11:50:52 and FAILED the requirements for a valid MOT with 1 comments.

This test (272547956115) was completed on the 06 June 2006 11:50:52 and FAILED the requirements for a valid MOT with 1 comments.

Recorded mileage: 45,921

Recorded mileage: 45,921


FAIL