402 RBF


402RBF is registered to a Green 1963, Morris Minor 1000 with a Petrol engine. It Failed its most recent MOT Test on the 17 March 2018

11 unique faults (13 Total) reported in its MOT History (10 Tests).

1 common/recurring faults.

70% (7) MOT Pass Rate and a 30% (3) MOT Failure Rate.

64,707 recorded miles.

402 RBF


402RBF is registered to a Green 1963, Morris Minor 1000 with a Petrol engine. It Failed its most recent MOT Test on the 17 March 2018

11 unique faults (13 Total) reported in its MOT History (10 Tests).

1 common/recurring faults.

70% (7) MOT Pass Rate and a 30% (3) MOT Failure Rate.

64,707 recorded miles.

MOT PASS/Failure rate for 402 RBF

all MOT test results for 402 RBF represented as a percentage
MOT PASS/Failure rate for 402 RBF
all MOT test results for 402 RBF represented as a percentage

PERCENTAGE OF VEHICLE FAULTS WITH 402 RBF

ALL REPORTED FAULTS, DISPLAYED BY PERCENTAGE OF OCCURRENCE DURING ALL MOT TESTS
PERCENTAGE OF VEHICLE FAULTS WITH 402 RBF
ALL REPORTED FAULTS, DISPLAYED BY PERCENTAGE OF OCCURRENCE DURING ALL MOT TESTS
FAIL

402 RBF annual Faults by type

ALL REPORTED FAULTS, DISPLAYED over time and categorised by type
402 RBF annual Faults by type
ALL REPORTED FAULTS, DISPLAYED over time and categorised by type

ALL 402 RBF Failure Faults [13]

ALL Failure faults, ORDERED by OCCURRENCE DURING 402 RBF's MOT HISTORY
ALL 402 RBF Failure Faults [13]
ALL Failure faults, ORDERED by OCCURRENCE DURING 402 RBF's MOT HISTORY
Fail Faults | source www.vehiclestats.co.uk
Fault Fault Test Date Test Date/Time Reference MOT Test Reference
3 Parking brake: efficiency below requirements (3.7.b.7) Parking brake: efficiency below requirements (3.7.b.7) 16 March 2017 [15:26] 16/03/2017 02 August 2007 [10:52] 02/08/2007 31 March 2006 [10:19] 31/03/2006 483341433812 483341433812 324344817402 324344817402 384390896035 384390896035
1 Front brake application uneven (3.7.b.2) Front brake application uneven (3.7.b.2) 16 March 2017 [15:26] 16/03/2017 483341433812 483341433812
1 Rear brake application uneven (3.7.b.2) Rear brake application uneven (3.7.b.2) 16 March 2017 [15:26] 16/03/2017 483341433812 483341433812
1 Nearside suspension component mounting prescribed area is excessively corroded (2.4.a.3) Nearside suspension component mounting prescribed area is excessively corroded (2.4.a.3) 16 March 2017 [15:26] 16/03/2017 483341433812 483341433812
1 Offside suspension component mounting prescribed area is excessively corroded (2.4.a.3) Offside suspension component mounting prescribed area is excessively corroded (2.4.a.3) 16 March 2017 [15:26] 16/03/2017 483341433812 483341433812
1 Service brake: efficiency below requirements (3.7.b.7) Service brake: efficiency below requirements (3.7.b.7) 16 March 2017 [15:26] 16/03/2017 483341433812 483341433812
1 Rear brakes imbalanced across an axle axle 2 (3.7.b.5b) Rear brakes imbalanced across an axle axle 2 (3.7.b.5b) 16 March 2017 [15:26] 16/03/2017 483341433812 483341433812
1 Offside rear brake recording little or no effort (3.7.b.5a) Offside rear brake recording little or no effort (3.7.b.5a) 02 August 2007 [10:52] 02/08/2007 324344817402 324344817402
1 Offside outer front suspension has excessive movement at a wishbone pin or bush (2.5.a.1c) Offside outer front suspension has excessive movement at a wishbone pin or bush (2.5.a.1c) 31 March 2006 [10:19] 31/03/2006 384390896035 384390896035
1 Nearside inner front suspension has excessive movement at a wishbone pin or bush (2.5.a.1c) Nearside inner front suspension has excessive movement at a wishbone pin or bush (2.5.a.1c) 31 March 2006 [10:19] 31/03/2006 384390896035 384390896035
1 Nearside rear parking brake recording little or no effort (3.7.b.6a) Nearside rear parking brake recording little or no effort (3.7.b.6a) 31 March 2006 [10:19] 31/03/2006 384390896035 384390896035

MOT TEST: 17 March 2018 11:17:49 PASSED
MOT TEST: 17 March 2018 11:17:49 PASSED

This test (351260038356) was completed on the 17 March 2018 11:17:49 and PASSED the requirements for a valid MOT with 0 comments.

This test (351260038356) was completed on the 17 March 2018 11:17:49 and PASSED the requirements for a valid MOT with 0 comments.

Recorded mileage: 64,707

Recorded mileage: 64,707


MOT TEST: 17 March 2017 13:45:52 PASSED
MOT TEST: 17 March 2017 13:45:52 PASSED

This test (882081376753) was completed on the 17 March 2017 13:45:52 and PASSED the requirements for a valid MOT with 0 comments.

This test (882081376753) was completed on the 17 March 2017 13:45:52 and PASSED the requirements for a valid MOT with 0 comments.

Recorded mileage: 64,667

Recorded mileage: 64,667


MOT TEST: 16 March 2017 15:26:12 FAILED
MOT TEST: 16 March 2017 15:26:12 FAILED

This test (483341433812) was completed on the 16 March 2017 15:26:12 and FAILED the requirements for a valid MOT with 7 comments.

This test (483341433812) was completed on the 16 March 2017 15:26:12 and FAILED the requirements for a valid MOT with 7 comments.

Recorded mileage: 64,661

Recorded mileage: 64,661


FAIL


MOT TEST: 05 March 2016 15:31:27 PASSED
MOT TEST: 05 March 2016 15:31:27 PASSED

This test (983282073341) was completed on the 05 March 2016 15:31:27 and PASSED the requirements for a valid MOT with 0 comments.

This test (983282073341) was completed on the 05 March 2016 15:31:27 and PASSED the requirements for a valid MOT with 0 comments.

Recorded mileage: 64,655

Recorded mileage: 64,655


MOT TEST: 07 March 2015 13:52:49 PASSED
MOT TEST: 07 March 2015 13:52:49 PASSED

This test (808396465012) was completed on the 07 March 2015 13:52:49 and PASSED the requirements for a valid MOT with 0 comments.

This test (808396465012) was completed on the 07 March 2015 13:52:49 and PASSED the requirements for a valid MOT with 0 comments.

Recorded mileage: 64,287

Recorded mileage: 64,287


MOT TEST: 29 March 2014 07:29:45 PASSED
MOT TEST: 29 March 2014 07:29:45 PASSED

This test (265798984057) was completed on the 29 March 2014 07:29:45 and PASSED the requirements for a valid MOT with 0 comments.

This test (265798984057) was completed on the 29 March 2014 07:29:45 and PASSED the requirements for a valid MOT with 0 comments.

Recorded mileage: 64,264

Recorded mileage: 64,264


MOT TEST: 02 August 2007 16:54:39 PASSED
MOT TEST: 02 August 2007 16:54:39 PASSED

This test (192624217251) was completed on the 02 August 2007 16:54:39 and PASSED the requirements for a valid MOT with 0 comments.

This test (192624217251) was completed on the 02 August 2007 16:54:39 and PASSED the requirements for a valid MOT with 0 comments.

Recorded mileage: 64,262

Recorded mileage: 64,262


MOT TEST: 02 August 2007 10:52:57 FAILED
MOT TEST: 02 August 2007 10:52:57 FAILED

This test (324344817402) was completed on the 02 August 2007 10:52:57 and FAILED the requirements for a valid MOT with 2 comments.

This test (324344817402) was completed on the 02 August 2007 10:52:57 and FAILED the requirements for a valid MOT with 2 comments.

Recorded mileage: 64,252

Recorded mileage: 64,252


FAIL


MOT TEST: 07 April 2006 10:40:31 PASSED
MOT TEST: 07 April 2006 10:40:31 PASSED

This test (990477796082) was completed on the 07 April 2006 10:40:31 and PASSED the requirements for a valid MOT with 0 comments.

This test (990477796082) was completed on the 07 April 2006 10:40:31 and PASSED the requirements for a valid MOT with 0 comments.

Recorded mileage: 63,903

Recorded mileage: 63,903


MOT TEST: 31 March 2006 10:19:02 FAILED
MOT TEST: 31 March 2006 10:19:02 FAILED

This test (384390896035) was completed on the 31 March 2006 10:19:02 and FAILED the requirements for a valid MOT with 4 comments.

This test (384390896035) was completed on the 31 March 2006 10:19:02 and FAILED the requirements for a valid MOT with 4 comments.

Recorded mileage: 63,899

Recorded mileage: 63,899


FAIL