411 UYE


411UYE is registered to a Green 1963, Morris Minor 1000 with a Petrol engine. It Failed its most recent MOT Test on the 14 March 2017

27 unique faults (33 Total) reported in its MOT History (8 Tests).

5 common/recurring faults, the most frequent (3 times) is: Nearside Front Tyre worn close to the legal limit (4.1.E.1).

62% (5) MOT Pass Rate and a 38% (3) MOT Failure Rate.

31,659 recorded miles.

411 UYE


411UYE is registered to a Green 1963, Morris Minor 1000 with a Petrol engine. It Failed its most recent MOT Test on the 14 March 2017

27 unique faults (33 Total) reported in its MOT History (8 Tests).

5 common/recurring faults, the most frequent (3 times) is: Nearside Front Tyre worn close to the legal limit (4.1.E.1).

62% (5) MOT Pass Rate and a 38% (3) MOT Failure Rate.

31,659 recorded miles.

MOT PASS/Failure rate for 411 UYE

all MOT test results for 411 UYE represented as a percentage
MOT PASS/Failure rate for 411 UYE
all MOT test results for 411 UYE represented as a percentage

PERCENTAGE OF VEHICLE FAULTS WITH 411 UYE

ALL REPORTED FAULTS, DISPLAYED BY PERCENTAGE OF OCCURRENCE DURING ALL MOT TESTS
PERCENTAGE OF VEHICLE FAULTS WITH 411 UYE
ALL REPORTED FAULTS, DISPLAYED BY PERCENTAGE OF OCCURRENCE DURING ALL MOT TESTS
ADVISORY

FAIL

USER ENTERED

411 UYE annual Faults by type

ALL REPORTED FAULTS, DISPLAYED over time and categorised by type
411 UYE annual Faults by type
ALL REPORTED FAULTS, DISPLAYED over time and categorised by type

RECURRING FAULTS WITH 411 UYE

FAULTS THAT HAVE OCCURED MORE THAN ONCE DURING 411 UYE's MOT HISTORY
RECURRING FAULTS WITH 411 UYE
FAULTS THAT HAVE OCCURED MORE THAN ONCE DURING 411 UYE's MOT HISTORY
Fault Fault Test Date Test Date/Time Reference MOT Test Reference
3 Nearside front tyre worn close to the legal limit (4.1.e.1) Nearside front tyre worn close to the legal limit (4.1.e.1) 22 October 2013 [09:48] 22/10/2013 02 August 2012 [11:46] 02/08/2012 04 July 2012 [10:18] 04/07/2012 949175993259 949175993259 959835912254 959835912254 477386482166 477386482166
2 Windscreen washer provides insufficient washer liquid (8.2.3) Windscreen washer provides insufficient washer liquid (8.2.3) 10 October 2016 [10:50] 10/10/2016 12 October 2015 [10:55] 12/10/2015 732346352289 732346352289 805856269605 805856269605
2 Nearside rear vehicle structure has slight corrosion (6.1.b.2) Nearside rear vehicle structure has slight corrosion (6.1.b.2) 13 October 2015 [08:52] 13/10/2015 12 October 2015 [10:55] 12/10/2015 802978270300 802978270300 805856269605 805856269605
2 Nearside rear vehicle structure has slight corrosion inner arch (6.1.b.2) Nearside rear vehicle structure has slight corrosion inner arch (6.1.b.2) 13 October 2015 [08:52] 13/10/2015 12 October 2015 [10:55] 12/10/2015 802978270300 802978270300 805856269605 805856269605
2 Nearside rear vehicle structure has slight corrosion inside boot (6.1.b.2) Nearside rear vehicle structure has slight corrosion inside boot (6.1.b.2) 13 October 2015 [08:52] 13/10/2015 12 October 2015 [10:55] 12/10/2015 802978270300 802978270300 805856269605 805856269605

ALL 411 UYE ADVISORIES [17]

ALL ADVISORIES, ORDERED by OCCURRENCE DURING 411 UYE's MOT HISTORY
ALL 411 UYE ADVISORIES [17]
ALL ADVISORIES, ORDERED by OCCURRENCE DURING 411 UYE's MOT HISTORY
Advisory Faults | source www.vehiclestats.co.uk
Fault Fault Test Date Test Date/Time Reference MOT Test Reference
3 Nearside front tyre worn close to the legal limit (4.1.e.1) Nearside front tyre worn close to the legal limit (4.1.e.1) 22 October 2013 [09:48] 22/10/2013 02 August 2012 [11:46] 02/08/2012 04 July 2012 [10:18] 04/07/2012 949175993259 949175993259 959835912254 959835912254 477386482166 477386482166
2 Nearside rear vehicle structure has slight corrosion (6.1.b.2) Nearside rear vehicle structure has slight corrosion (6.1.b.2) 13 October 2015 [08:52] 13/10/2015 12 October 2015 [10:55] 12/10/2015 802978270300 802978270300 805856269605 805856269605
2 Nearside rear vehicle structure has slight corrosion inner arch (6.1.b.2) Nearside rear vehicle structure has slight corrosion inner arch (6.1.b.2) 13 October 2015 [08:52] 13/10/2015 12 October 2015 [10:55] 12/10/2015 802978270300 802978270300 805856269605 805856269605
2 Nearside rear vehicle structure has slight corrosion inside boot (6.1.b.2) Nearside rear vehicle structure has slight corrosion inside boot (6.1.b.2) 13 October 2015 [08:52] 13/10/2015 12 October 2015 [10:55] 12/10/2015 802978270300 802978270300 805856269605 805856269605
1 Nearside front upper vehicle structure has slight corrosion wheel arch (6.1.b.2) Nearside front upper vehicle structure has slight corrosion wheel arch (6.1.b.2) 10 October 2016 [10:50] 10/10/2016 732346352289 732346352289
1 Centre exhaust has a minor leak of exhaust gases (7.1.2) Centre exhaust has a minor leak of exhaust gases (7.1.2) 22 October 2013 [09:48] 22/10/2013 949175993259 949175993259
1 Offside front wheel bearing has slight play (2.5.a.3c) Offside front wheel bearing has slight play (2.5.a.3c) 22 October 2013 [09:48] 22/10/2013 949175993259 949175993259
1 Rear service brake: service brake efficiency only just met. It would appear that the braking system requires adjustment or repair. (3.7.b.7) Rear service brake: service brake efficiency only just met. It would appear that the braking system requires adjustment or repair. (3.7.b.7) 22 October 2013 [09:48] 22/10/2013 949175993259 949175993259
1 Nearside front brake pipe slightly corroded (3.6.b.2c) Nearside front brake pipe slightly corroded (3.6.b.2c) 02 August 2012 [11:46] 02/08/2012 959835912254 959835912254
1 Offside front brake pipe slightly corroded (3.6.b.2c) Offside front brake pipe slightly corroded (3.6.b.2c) 02 August 2012 [11:46] 02/08/2012 959835912254 959835912254
1 Nearside rear brake pipe slightly corroded (3.6.b.2c) Nearside rear brake pipe slightly corroded (3.6.b.2c) 04 July 2012 [10:18] 04/07/2012 477386482166 477386482166
1 Offside rear brake pipe slightly corroded (3.6.b.2c) Offside rear brake pipe slightly corroded (3.6.b.2c) 04 July 2012 [10:18] 04/07/2012 477386482166 477386482166

ALL 411 UYE Failure Faults [10]

ALL Failure faults, ORDERED by OCCURRENCE DURING 411 UYE's MOT HISTORY
ALL 411 UYE Failure Faults [10]
ALL Failure faults, ORDERED by OCCURRENCE DURING 411 UYE's MOT HISTORY
Fail Faults | source www.vehiclestats.co.uk
Fault Fault Test Date Test Date/Time Reference MOT Test Reference
2 Windscreen washer provides insufficient washer liquid (8.2.3) Windscreen washer provides insufficient washer liquid (8.2.3) 10 October 2016 [10:50] 10/10/2016 12 October 2015 [10:55] 12/10/2015 732346352289 732346352289 805856269605 805856269605
1 Horn not working (1.6.2a) Horn not working (1.6.2a) 10 October 2016 [10:50] 10/10/2016 732346352289 732346352289
1 Offside rear suspension component mounting prescribed area is excessively corroded drop link (2.4.a.3) Offside rear suspension component mounting prescribed area is excessively corroded drop link (2.4.a.3) 10 October 2016 [10:50] 10/10/2016 732346352289 732346352289
1 Offside front vehicle structure has excessive corrosion, seriously affecting its strength within 30cm of the body mountings chasis (6.1.b.2) Offside front vehicle structure has excessive corrosion, seriously affecting its strength within 30cm of the body mountings chasis (6.1.b.2) 10 October 2016 [10:50] 10/10/2016 732346352289 732346352289
1 Offside headlamp not working on dipped beam (1.7.5a) Offside headlamp not working on dipped beam (1.7.5a) 04 July 2012 [10:18] 04/07/2012 477386482166 477386482166
1 Offside rear suspension component mounting prescribed area is excessively corroded (2.4.a.3) Offside rear suspension component mounting prescribed area is excessively corroded (2.4.a.3) 04 July 2012 [10:18] 04/07/2012 477386482166 477386482166
1 Nearside rear suspension component mounting prescribed area is excessively corroded (2.4.a.3) Nearside rear suspension component mounting prescribed area is excessively corroded (2.4.a.3) 04 July 2012 [10:18] 04/07/2012 477386482166 477386482166
1 Nearside front suspension component mounting prescribed area is excessively corroded (2.4.a.3) Nearside front suspension component mounting prescribed area is excessively corroded (2.4.a.3) 04 July 2012 [10:18] 04/07/2012 477386482166 477386482166
1 Brakes imbalanced across an axle (3.7.b.5b) Brakes imbalanced across an axle (3.7.b.5b) 04 July 2012 [10:18] 04/07/2012 477386482166 477386482166

ALL 411 UYE User Entered Faults [6]

ALL User Entered faults, ORDERED by OCCURRENCE DURING 411 UYE's MOT HISTORY
ALL 411 UYE User Entered Faults [6]
ALL User Entered faults, ORDERED by OCCURRENCE DURING 411 UYE's MOT HISTORY
Advisory Faults | source www.vehiclestats.co.uk
Fault Fault Test Date Test Date/Time Reference MOT Test Reference
1 All underside has corrosion All underside has corrosion 02 August 2012 [11:46] 02/08/2012 959835912254 959835912254
1 O/s/f tyre tread cracking (no cords visible) O/s/f tyre tread cracking (no cords visible) 02 August 2012 [11:46] 02/08/2012 959835912254 959835912254
1 Car pulling to right very slightly on brake test Car pulling to right very slightly on brake test 02 August 2012 [11:46] 02/08/2012 959835912254 959835912254
1 Main beam warning light illuminating on dip beam Main beam warning light illuminating on dip beam 04 July 2012 [10:18] 04/07/2012 477386482166 477386482166
1 All underside of car corroded All underside of car corroded 04 July 2012 [10:18] 04/07/2012 477386482166 477386482166
1 O/s/f tyre tread badly cracked (no cords visible) O/s/f tyre tread badly cracked (no cords visible) 04 July 2012 [10:18] 04/07/2012 477386482166 477386482166

MOT TEST: 14 March 2017 11:03:42 PASSED
MOT TEST: 14 March 2017 11:03:42 PASSED

This test (646455069575) was completed on the 14 March 2017 11:03:42 and PASSED the requirements for a valid MOT with 0 comments.

This test (646455069575) was completed on the 14 March 2017 11:03:42 and PASSED the requirements for a valid MOT with 0 comments.

Recorded mileage: 31,659

Recorded mileage: 31,659


MOT TEST: 10 October 2016 10:50:22 FAILED
MOT TEST: 10 October 2016 10:50:22 FAILED

This test (732346352289) was completed on the 10 October 2016 10:50:22 and FAILED the requirements for a valid MOT with 5 comments.

This test (732346352289) was completed on the 10 October 2016 10:50:22 and FAILED the requirements for a valid MOT with 5 comments.

Recorded mileage: 31,653

Recorded mileage: 31,653


ADVISORY

FAIL


MOT TEST: 13 October 2015 08:52:26 PASSED
MOT TEST: 13 October 2015 08:52:26 PASSED

This test (802978270300) was completed on the 13 October 2015 08:52:26 and PASSED the requirements for a valid MOT with 3 comments.

This test (802978270300) was completed on the 13 October 2015 08:52:26 and PASSED the requirements for a valid MOT with 3 comments.

Recorded mileage: 31,522

Recorded mileage: 31,522


ADVISORY


MOT TEST: 12 October 2015 10:55:46 FAILED
MOT TEST: 12 October 2015 10:55:46 FAILED

This test (805856269605) was completed on the 12 October 2015 10:55:46 and FAILED the requirements for a valid MOT with 4 comments.

This test (805856269605) was completed on the 12 October 2015 10:55:46 and FAILED the requirements for a valid MOT with 4 comments.

Recorded mileage: 31,521

Recorded mileage: 31,521


ADVISORY

FAIL


MOT TEST: 14 October 2014 11:29:12 PASSED
MOT TEST: 14 October 2014 11:29:12 PASSED

This test (668817584272) was completed on the 14 October 2014 11:29:12 and PASSED the requirements for a valid MOT with 0 comments.

This test (668817584272) was completed on the 14 October 2014 11:29:12 and PASSED the requirements for a valid MOT with 0 comments.

Recorded mileage: 31,206

Recorded mileage: 31,206


MOT TEST: 22 October 2013 09:48:56 PASSED
MOT TEST: 22 October 2013 09:48:56 PASSED

This test (949175993259) was completed on the 22 October 2013 09:48:56 and PASSED the requirements for a valid MOT with 4 comments.

This test (949175993259) was completed on the 22 October 2013 09:48:56 and PASSED the requirements for a valid MOT with 4 comments.

Recorded mileage: 31,005

Recorded mileage: 31,005


ADVISORY


MOT TEST: 02 August 2012 11:46:17 PASSED
MOT TEST: 02 August 2012 11:46:17 PASSED

This test (959835912254) was completed on the 02 August 2012 11:46:17 and PASSED the requirements for a valid MOT with 6 comments.

This test (959835912254) was completed on the 02 August 2012 11:46:17 and PASSED the requirements for a valid MOT with 6 comments.

Recorded mileage: 30,948

Recorded mileage: 30,948


ADVISORY

USER ENTERED


MOT TEST: 04 July 2012 10:18:06 FAILED
MOT TEST: 04 July 2012 10:18:06 FAILED

This test (477386482166) was completed on the 04 July 2012 10:18:06 and FAILED the requirements for a valid MOT with 11 comments.

This test (477386482166) was completed on the 04 July 2012 10:18:06 and FAILED the requirements for a valid MOT with 11 comments.

Recorded mileage: 30,945

Recorded mileage: 30,945


ADVISORY

FAIL

USER ENTERED