423 KCG


423KCG is registered to a Blue 1964, Morris Minor with a Petrol engine. It Failed its most recent MOT Test on the 23 August 2017

4 unique faults (4 Total) reported in its MOT History (6 Tests).

0 common/recurring faults.

83% (5) MOT Pass Rate and a 17% (1) MOT Failure Rate.

37,926 recorded miles.

423 KCG


423KCG is registered to a Blue 1964, Morris Minor with a Petrol engine. It Failed its most recent MOT Test on the 23 August 2017

4 unique faults (4 Total) reported in its MOT History (6 Tests).

0 common/recurring faults.

83% (5) MOT Pass Rate and a 17% (1) MOT Failure Rate.

37,926 recorded miles.

MOT PASS/Failure rate for 423 KCG

all MOT test results for 423 KCG represented as a percentage
MOT PASS/Failure rate for 423 KCG
all MOT test results for 423 KCG represented as a percentage

PERCENTAGE OF VEHICLE FAULTS WITH 423 KCG

ALL REPORTED FAULTS, DISPLAYED BY PERCENTAGE OF OCCURRENCE DURING ALL MOT TESTS
PERCENTAGE OF VEHICLE FAULTS WITH 423 KCG
ALL REPORTED FAULTS, DISPLAYED BY PERCENTAGE OF OCCURRENCE DURING ALL MOT TESTS
ADVISORY

FAIL

423 KCG annual Faults by type

ALL REPORTED FAULTS, DISPLAYED over time and categorised by type
423 KCG annual Faults by type
ALL REPORTED FAULTS, DISPLAYED over time and categorised by type

ALL 423 KCG ADVISORIES [1]

ALL ADVISORIES, ORDERED by OCCURRENCE DURING 423 KCG's MOT HISTORY
ALL 423 KCG ADVISORIES [1]
ALL ADVISORIES, ORDERED by OCCURRENCE DURING 423 KCG's MOT HISTORY
Advisory Faults | source www.vehiclestats.co.uk
Fault Fault Test Date Test Date/Time Reference MOT Test Reference
1 Front track rod end ball joint dust cover deteriorated, but preventing the ingress of dirt (2.2.c.1c) Front track rod end ball joint dust cover deteriorated, but preventing the ingress of dirt (2.2.c.1c) 27 June 2016 [08:05] 27/06/2016 794990992006 794990992006

ALL 423 KCG Failure Faults [3]

ALL Failure faults, ORDERED by OCCURRENCE DURING 423 KCG's MOT HISTORY
ALL 423 KCG Failure Faults [3]
ALL Failure faults, ORDERED by OCCURRENCE DURING 423 KCG's MOT HISTORY
Fail Faults | source www.vehiclestats.co.uk
Fault Fault Test Date Test Date/Time Reference MOT Test Reference
1 Suspension component mounting prescribed area is excessively corroded offside front chassis (2.4.a.3) Suspension component mounting prescribed area is excessively corroded offside front chassis (2.4.a.3) 23 August 2017 [07:51] 23/08/2017 264264037248 264264037248
1 Nearside headlamp not working on main beam (1.7.5a) Nearside headlamp not working on main beam (1.7.5a) 23 August 2017 [07:51] 23/08/2017 264264037248 264264037248
1 Offside rear parking brake recording little or no effort (3.7.b.6a) Offside rear parking brake recording little or no effort (3.7.b.6a) 23 August 2017 [07:51] 23/08/2017 264264037248 264264037248

MOT TEST: 23 August 2017 14:58:43 PASSED
MOT TEST: 23 August 2017 14:58:43 PASSED

This test (761994370642) was completed on the 23 August 2017 14:58:43 and PASSED the requirements for a valid MOT with 0 comments.

This test (761994370642) was completed on the 23 August 2017 14:58:43 and PASSED the requirements for a valid MOT with 0 comments.

Recorded mileage: 37,926

Recorded mileage: 37,926


MOT TEST: 23 August 2017 07:51:02 FAILED
MOT TEST: 23 August 2017 07:51:02 FAILED

This test (264264037248) was completed on the 23 August 2017 07:51:02 and FAILED the requirements for a valid MOT with 3 comments.

This test (264264037248) was completed on the 23 August 2017 07:51:02 and FAILED the requirements for a valid MOT with 3 comments.

Recorded mileage: 37,926

Recorded mileage: 37,926


FAIL


MOT TEST: 27 June 2016 08:05:17 PASSED
MOT TEST: 27 June 2016 08:05:17 PASSED

This test (794990992006) was completed on the 27 June 2016 08:05:17 and PASSED the requirements for a valid MOT with 1 comments.

This test (794990992006) was completed on the 27 June 2016 08:05:17 and PASSED the requirements for a valid MOT with 1 comments.

Recorded mileage: 36,866

Recorded mileage: 36,866


ADVISORY


MOT TEST: 03 June 2015 15:47:10 PASSED
MOT TEST: 03 June 2015 15:47:10 PASSED

This test (629764355148) was completed on the 03 June 2015 15:47:10 and PASSED the requirements for a valid MOT with 0 comments.

This test (629764355148) was completed on the 03 June 2015 15:47:10 and PASSED the requirements for a valid MOT with 0 comments.

Recorded mileage: 35,930

Recorded mileage: 35,930


MOT TEST: 04 April 2014 19:15:44 PASSED
MOT TEST: 04 April 2014 19:15:44 PASSED

This test (585334694069) was completed on the 04 April 2014 19:15:44 and PASSED the requirements for a valid MOT with 0 comments.

This test (585334694069) was completed on the 04 April 2014 19:15:44 and PASSED the requirements for a valid MOT with 0 comments.

Recorded mileage: 35,918

Recorded mileage: 35,918


MOT TEST: 03 May 2011 14:45:28 PASSED
MOT TEST: 03 May 2011 14:45:28 PASSED

This test (898033521131) was completed on the 03 May 2011 14:45:28 and PASSED the requirements for a valid MOT with 0 comments.

This test (898033521131) was completed on the 03 May 2011 14:45:28 and PASSED the requirements for a valid MOT with 0 comments.

Recorded mileage: 35,875

Recorded mileage: 35,875