423 VKO


423VKO is registered to a Green 1963, Morris Minor 1000 with a Petrol engine. It Failed its most recent MOT Test on the 01 May 2013

11 unique faults (15 Total) reported in its MOT History (10 Tests).

3 common/recurring faults, the most frequent (3 times) is: Parking brake: efficiency below requirements (3.7.B.7).

60% (6) MOT Pass Rate and a 40% (4) MOT Failure Rate.

92,952 recorded miles.

423 VKO


423VKO is registered to a Green 1963, Morris Minor 1000 with a Petrol engine. It Failed its most recent MOT Test on the 01 May 2013

11 unique faults (15 Total) reported in its MOT History (10 Tests).

3 common/recurring faults, the most frequent (3 times) is: Parking brake: efficiency below requirements (3.7.B.7).

60% (6) MOT Pass Rate and a 40% (4) MOT Failure Rate.

92,952 recorded miles.

MOT PASS/Failure rate for 423 VKO

all MOT test results for 423 VKO represented as a percentage
MOT PASS/Failure rate for 423 VKO
all MOT test results for 423 VKO represented as a percentage

PERCENTAGE OF VEHICLE FAULTS WITH 423 VKO

ALL REPORTED FAULTS, DISPLAYED BY PERCENTAGE OF OCCURRENCE DURING ALL MOT TESTS
PERCENTAGE OF VEHICLE FAULTS WITH 423 VKO
ALL REPORTED FAULTS, DISPLAYED BY PERCENTAGE OF OCCURRENCE DURING ALL MOT TESTS
ADVISORY

FAIL

423 VKO annual Faults by type

ALL REPORTED FAULTS, DISPLAYED over time and categorised by type
423 VKO annual Faults by type
ALL REPORTED FAULTS, DISPLAYED over time and categorised by type

RECURRING FAULTS WITH 423 VKO

FAULTS THAT HAVE OCCURED MORE THAN ONCE DURING 423 VKO's MOT HISTORY
RECURRING FAULTS WITH 423 VKO
FAULTS THAT HAVE OCCURED MORE THAN ONCE DURING 423 VKO's MOT HISTORY
Fault Fault Test Date Test Date/Time Reference MOT Test Reference
3 Parking brake: efficiency below requirements (3.7.b.7) Parking brake: efficiency below requirements (3.7.b.7) 14 April 2012 [12:50] 14/04/2012 25 November 2009 [10:23] 25/11/2009 26 June 2006 [10:15] 26/06/2006 436025702115 436025702115 213599329353 213599329353 980487276133 980487276133
2 Brakes imbalanced across an axle (3.7.b.5b) Brakes imbalanced across an axle (3.7.b.5b) 19 April 2013 [14:57] 19/04/2013 14 April 2012 [12:50] 14/04/2012 496229203175 496229203175 436025702115 436025702115
2 Offside windscreen wiper does not clear the windscreen effectively (8.2.2) Offside windscreen wiper does not clear the windscreen effectively (8.2.2) 19 April 2013 [14:57] 19/04/2013 25 November 2009 [10:23] 25/11/2009 496229203175 496229203175 213599329353 213599329353

ALL 423 VKO ADVISORIES [1]

ALL ADVISORIES, ORDERED by OCCURRENCE DURING 423 VKO's MOT HISTORY
ALL 423 VKO ADVISORIES [1]
ALL ADVISORIES, ORDERED by OCCURRENCE DURING 423 VKO's MOT HISTORY
Advisory Faults | source www.vehiclestats.co.uk
Fault Fault Test Date Test Date/Time Reference MOT Test Reference
1 Offside front suspension has slight play in a lower suspension ball joint (2.5.b.1a) Offside front suspension has slight play in a lower suspension ball joint (2.5.b.1a) 29 June 2007 [10:49] 29/06/2007 892230087193 892230087193

ALL 423 VKO Failure Faults [14]

ALL Failure faults, ORDERED by OCCURRENCE DURING 423 VKO's MOT HISTORY
ALL 423 VKO Failure Faults [14]
ALL Failure faults, ORDERED by OCCURRENCE DURING 423 VKO's MOT HISTORY
Fail Faults | source www.vehiclestats.co.uk
Fault Fault Test Date Test Date/Time Reference MOT Test Reference
3 Parking brake: efficiency below requirements (3.7.b.7) Parking brake: efficiency below requirements (3.7.b.7) 14 April 2012 [12:50] 14/04/2012 25 November 2009 [10:23] 25/11/2009 26 June 2006 [10:15] 26/06/2006 436025702115 436025702115 213599329353 213599329353 980487276133 980487276133
2 Brakes imbalanced across an axle (3.7.b.5b) Brakes imbalanced across an axle (3.7.b.5b) 19 April 2013 [14:57] 19/04/2013 14 April 2012 [12:50] 14/04/2012 496229203175 496229203175 436025702115 436025702115
2 Offside windscreen wiper does not clear the windscreen effectively (8.2.2) Offside windscreen wiper does not clear the windscreen effectively (8.2.2) 19 April 2013 [14:57] 19/04/2013 25 November 2009 [10:23] 25/11/2009 496229203175 496229203175 213599329353 213599329353
1 Nearside windscreen wiper does not clear the windscreen effectively (8.2.2) Nearside windscreen wiper does not clear the windscreen effectively (8.2.2) 19 April 2013 [14:57] 19/04/2013 496229203175 496229203175
1 Nearside front brake binding (3.7.b.1) Nearside front brake binding (3.7.b.1) 19 April 2013 [14:57] 19/04/2013 496229203175 496229203175
1 Offside front brake binding (3.7.b.1) Offside front brake binding (3.7.b.1) 19 April 2013 [14:57] 19/04/2013 496229203175 496229203175
1 Nearside upper front suspension has excessive play in a upper suspension ball joint (2.5.b.1a) Nearside upper front suspension has excessive play in a upper suspension ball joint (2.5.b.1a) 19 April 2013 [14:57] 19/04/2013 496229203175 496229203175
1 Offside front brake pipe excessively corroded (3.6.b.2c) Offside front brake pipe excessively corroded (3.6.b.2c) 14 April 2012 [12:50] 14/04/2012 436025702115 436025702115
1 Offside front vehicle structure has excessive corrosion which adversely affects braking or steering (6.1.a.1) Offside front vehicle structure has excessive corrosion which adversely affects braking or steering (6.1.a.1) 14 April 2012 [12:50] 14/04/2012 436025702115 436025702115
1 Nearside front suspension has excessive play in a upper suspension ball joint (2.5.b.1a) Nearside front suspension has excessive play in a upper suspension ball joint (2.5.b.1a) 14 April 2012 [12:50] 14/04/2012 436025702115 436025702115

MOT TEST: 01 May 2013 17:38:22 PASSED
MOT TEST: 01 May 2013 17:38:22 PASSED

This test (708931423175) was completed on the 01 May 2013 17:38:22 and PASSED the requirements for a valid MOT with 0 comments.

This test (708931423175) was completed on the 01 May 2013 17:38:22 and PASSED the requirements for a valid MOT with 0 comments.

Recorded mileage: 92,952

Recorded mileage: 92,952


MOT TEST: 19 April 2013 14:57:24 FAILED
MOT TEST: 19 April 2013 14:57:24 FAILED

This test (496229203175) was completed on the 19 April 2013 14:57:24 and FAILED the requirements for a valid MOT with 6 comments.

This test (496229203175) was completed on the 19 April 2013 14:57:24 and FAILED the requirements for a valid MOT with 6 comments.

Recorded mileage: 92,941

Recorded mileage: 92,941


FAIL


MOT TEST: 23 April 2012 12:52:25 PASSED
MOT TEST: 23 April 2012 12:52:25 PASSED

This test (705374512136) was completed on the 23 April 2012 12:52:25 and PASSED the requirements for a valid MOT with 0 comments.

This test (705374512136) was completed on the 23 April 2012 12:52:25 and PASSED the requirements for a valid MOT with 0 comments.

Recorded mileage: 92,176

Recorded mileage: 92,176


MOT TEST: 14 April 2012 12:50:17 FAILED
MOT TEST: 14 April 2012 12:50:17 FAILED

This test (436025702115) was completed on the 14 April 2012 12:50:17 and FAILED the requirements for a valid MOT with 5 comments.

This test (436025702115) was completed on the 14 April 2012 12:50:17 and FAILED the requirements for a valid MOT with 5 comments.

Recorded mileage: 92,169

Recorded mileage: 92,169


FAIL


MOT TEST: 26 November 2009 14:44:03 PASSED
MOT TEST: 26 November 2009 14:44:03 PASSED

This test (591380439347) was completed on the 26 November 2009 14:44:03 and PASSED the requirements for a valid MOT with 0 comments.

This test (591380439347) was completed on the 26 November 2009 14:44:03 and PASSED the requirements for a valid MOT with 0 comments.

Recorded mileage: 91,845

Recorded mileage: 91,845


MOT TEST: 25 November 2009 10:23:05 FAILED
MOT TEST: 25 November 2009 10:23:05 FAILED

This test (213599329353) was completed on the 25 November 2009 10:23:05 and FAILED the requirements for a valid MOT with 2 comments.

This test (213599329353) was completed on the 25 November 2009 10:23:05 and FAILED the requirements for a valid MOT with 2 comments.

Recorded mileage: 91,839

Recorded mileage: 91,839


FAIL


MOT TEST: 30 June 2008 09:41:36 PASSED
MOT TEST: 30 June 2008 09:41:36 PASSED

This test (124822088171) was completed on the 30 June 2008 09:41:36 and PASSED the requirements for a valid MOT with 0 comments.

This test (124822088171) was completed on the 30 June 2008 09:41:36 and PASSED the requirements for a valid MOT with 0 comments.

Recorded mileage: 90,223

Recorded mileage: 90,223


MOT TEST: 29 June 2007 10:49:35 PASSED
MOT TEST: 29 June 2007 10:49:35 PASSED

This test (892230087193) was completed on the 29 June 2007 10:49:35 and PASSED the requirements for a valid MOT with 1 comments.

This test (892230087193) was completed on the 29 June 2007 10:49:35 and PASSED the requirements for a valid MOT with 1 comments.

Recorded mileage: 89,477

Recorded mileage: 89,477


ADVISORY


MOT TEST: 03 July 2006 18:02:10 PASSED
MOT TEST: 03 July 2006 18:02:10 PASSED

This test (564754086173) was completed on the 03 July 2006 18:02:10 and PASSED the requirements for a valid MOT with 0 comments.

This test (564754086173) was completed on the 03 July 2006 18:02:10 and PASSED the requirements for a valid MOT with 0 comments.

Recorded mileage: 89,322

Recorded mileage: 89,322


MOT TEST: 26 June 2006 10:15:11 FAILED
MOT TEST: 26 June 2006 10:15:11 FAILED

This test (980487276133) was completed on the 26 June 2006 10:15:11 and FAILED the requirements for a valid MOT with 1 comments.

This test (980487276133) was completed on the 26 June 2006 10:15:11 and FAILED the requirements for a valid MOT with 1 comments.

Recorded mileage: 89,304

Recorded mileage: 89,304


FAIL