423 WYD


423WYD is registered to a Cream 1964, Morris Minor with a Petrol engine. It Failed its most recent MOT Test on the 30 August 2013

53 unique faults (74 Total) reported in its MOT History (17 Tests).

13 common/recurring faults, the most frequent (5 times) is: Parking brake: efficiency below requirements (3.7.B.7).

47% (8) MOT Pass Rate and a 53% (9) MOT Failure Rate.

615,564 recorded miles.

423 WYD


423WYD is registered to a Cream 1964, Morris Minor with a Petrol engine. It Failed its most recent MOT Test on the 30 August 2013

53 unique faults (74 Total) reported in its MOT History (17 Tests).

13 common/recurring faults, the most frequent (5 times) is: Parking brake: efficiency below requirements (3.7.B.7).

47% (8) MOT Pass Rate and a 53% (9) MOT Failure Rate.

615,564 recorded miles.

MOT PASS/Failure rate for 423 WYD

all MOT test results for 423 WYD represented as a percentage
MOT PASS/Failure rate for 423 WYD
all MOT test results for 423 WYD represented as a percentage

PERCENTAGE OF VEHICLE FAULTS WITH 423 WYD

ALL REPORTED FAULTS, DISPLAYED BY PERCENTAGE OF OCCURRENCE DURING ALL MOT TESTS
PERCENTAGE OF VEHICLE FAULTS WITH 423 WYD
ALL REPORTED FAULTS, DISPLAYED BY PERCENTAGE OF OCCURRENCE DURING ALL MOT TESTS
ADVISORY

FAIL

USER ENTERED

PASS WITH RECTIFICATION

423 WYD annual Faults by type

ALL REPORTED FAULTS, DISPLAYED over time and categorised by type
423 WYD annual Faults by type
ALL REPORTED FAULTS, DISPLAYED over time and categorised by type

RECURRING FAULTS WITH 423 WYD

FAULTS THAT HAVE OCCURED MORE THAN ONCE DURING 423 WYD's MOT HISTORY
RECURRING FAULTS WITH 423 WYD
FAULTS THAT HAVE OCCURED MORE THAN ONCE DURING 423 WYD's MOT HISTORY
Fault Fault Test Date Test Date/Time Reference MOT Test Reference
5 Parking brake: efficiency below requirements (3.7.b.7) Parking brake: efficiency below requirements (3.7.b.7) 31 July 2013 [09:46] 31/07/2013 08 June 2012 [15:09] 08/06/2012 03 June 2011 [10:46] 03/06/2011 26 April 2010 [15:43] 26/04/2010 10 March 2007 [08:44] 10/03/2007 496532313208 496532313208 566040162150 566040162150 448414451191 448414451191 383056210158 383056210158 751009167093 751009167093
3 Service brake: efficiency below requirements (3.7.b.7) Service brake: efficiency below requirements (3.7.b.7) 31 July 2013 [09:46] 31/07/2013 08 June 2012 [15:09] 08/06/2012 03 June 2011 [10:46] 03/06/2011 496532313208 496532313208 566040162150 566040162150 448414451191 448414451191
3 Parking brake lever has no reserve travel (3.1.6b) Parking brake lever has no reserve travel (3.1.6b) 08 June 2012 [15:09] 08/06/2012 26 April 2010 [15:43] 26/04/2010 10 March 2007 [08:44] 10/03/2007 566040162150 566040162150 383056210158 383056210158 751009167093 751009167093
2 Nearside front vehicle structure has slight corrosion (6.1.b.2) Nearside front vehicle structure has slight corrosion (6.1.b.2) 22 June 2012 [16:00] 22/06/2012 08 June 2012 [15:09] 08/06/2012 759294272186 759294272186 566040162150 566040162150
2 Offside front vehicle structure has slight corrosion (6.1.b.2) Offside front vehicle structure has slight corrosion (6.1.b.2) 22 June 2012 [16:00] 22/06/2012 08 June 2012 [15:09] 08/06/2012 759294272186 759294272186 566040162150 566040162150
2 Nearside rear vehicle structure has slight corrosion (6.1.b.2) Nearside rear vehicle structure has slight corrosion (6.1.b.2) 22 June 2012 [16:00] 22/06/2012 08 June 2012 [15:09] 08/06/2012 759294272186 759294272186 566040162150 566040162150
2 Offside rear vehicle structure has slight corrosion (6.1.b.2) Offside rear vehicle structure has slight corrosion (6.1.b.2) 22 June 2012 [16:00] 22/06/2012 08 June 2012 [15:09] 08/06/2012 759294272186 759294272186 566040162150 566040162150
2 Rear registration plate lamp not working (1.1.c.1d) Rear registration plate lamp not working (1.1.c.1d) 08 June 2012 [15:09] 08/06/2012 16 February 2006 [13:16] 16/02/2006 566040162150 566040162150 830177146076 830177146076
2 Well & truly under seald ? Well & truly under seald ? 03 June 2011 [12:50] 03/06/2011 03 June 2011 [10:46] 03/06/2011 479174551137 479174551137 448414451191 448414451191
2 Nearside front wheel bearing has excessive play (2.5.a.3c) Nearside front wheel bearing has excessive play (2.5.a.3c) 29 April 2010 [14:13] 29/04/2010 18 March 2008 [15:02] 18/03/2008 502649510150 502649510150 242928878068 242928878068
2 Nearside front position lamp(s) not working (1.1.a.3b) Nearside front position lamp(s) not working (1.1.a.3b) 22 April 2009 [10:34] 22/04/2009 16 February 2006 [13:16] 16/02/2006 272182519476 272182519476 830177146076 830177146076
2 Front number plate designed to be easily removed Front number plate designed to be easily removed 20 March 2008 [16:40] 20/03/2008 18 March 2008 [15:02] 18/03/2008 993400888009 993400888009 242928878068 242928878068
2 Unable to satisfy condition of brake pipes due to covering of grease Unable to satisfy condition of brake pipes due to covering of grease 20 March 2008 [16:40] 20/03/2008 18 March 2008 [15:02] 18/03/2008 993400888009 993400888009 242928878068 242928878068

ALL 423 WYD ADVISORIES [11]

ALL ADVISORIES, ORDERED by OCCURRENCE DURING 423 WYD's MOT HISTORY
ALL 423 WYD ADVISORIES [11]
ALL ADVISORIES, ORDERED by OCCURRENCE DURING 423 WYD's MOT HISTORY
Advisory Faults | source www.vehiclestats.co.uk
Fault Fault Test Date Test Date/Time Reference MOT Test Reference
2 Nearside front vehicle structure has slight corrosion (6.1.b.2) Nearside front vehicle structure has slight corrosion (6.1.b.2) 22 June 2012 [16:00] 22/06/2012 08 June 2012 [15:09] 08/06/2012 759294272186 759294272186 566040162150 566040162150
2 Offside front vehicle structure has slight corrosion (6.1.b.2) Offside front vehicle structure has slight corrosion (6.1.b.2) 22 June 2012 [16:00] 22/06/2012 08 June 2012 [15:09] 08/06/2012 759294272186 759294272186 566040162150 566040162150
2 Nearside rear vehicle structure has slight corrosion (6.1.b.2) Nearside rear vehicle structure has slight corrosion (6.1.b.2) 22 June 2012 [16:00] 22/06/2012 08 June 2012 [15:09] 08/06/2012 759294272186 759294272186 566040162150 566040162150
2 Offside rear vehicle structure has slight corrosion (6.1.b.2) Offside rear vehicle structure has slight corrosion (6.1.b.2) 22 June 2012 [16:00] 22/06/2012 08 June 2012 [15:09] 08/06/2012 759294272186 759294272186 566040162150 566040162150
1 Offside front wheel bearing has slight play (2.5.a.3c) Offside front wheel bearing has slight play (2.5.a.3c) 03 June 2011 [12:50] 03/06/2011 479174551137 479174551137
1 Nearside front wheel bearing has slight play (2.5.a.3c) Nearside front wheel bearing has slight play (2.5.a.3c) 07 May 2010 [09:45] 07/05/2010 220427020146 220427020146
1 Nearside rear vehicle structure has slight corrosion (6.1.a.1) Nearside rear vehicle structure has slight corrosion (6.1.a.1) 10 March 2007 [08:44] 10/03/2007 751009167093 751009167093

ALL 423 WYD Failure Faults [45]

ALL Failure faults, ORDERED by OCCURRENCE DURING 423 WYD's MOT HISTORY
ALL 423 WYD Failure Faults [45]
ALL Failure faults, ORDERED by OCCURRENCE DURING 423 WYD's MOT HISTORY
Fail Faults | source www.vehiclestats.co.uk
Fault Fault Test Date Test Date/Time Reference MOT Test Reference
5 Parking brake: efficiency below requirements (3.7.b.7) Parking brake: efficiency below requirements (3.7.b.7) 31 July 2013 [09:46] 31/07/2013 08 June 2012 [15:09] 08/06/2012 03 June 2011 [10:46] 03/06/2011 26 April 2010 [15:43] 26/04/2010 10 March 2007 [08:44] 10/03/2007 496532313208 496532313208 566040162150 566040162150 448414451191 448414451191 383056210158 383056210158 751009167093 751009167093
3 Service brake: efficiency below requirements (3.7.b.7) Service brake: efficiency below requirements (3.7.b.7) 31 July 2013 [09:46] 31/07/2013 08 June 2012 [15:09] 08/06/2012 03 June 2011 [10:46] 03/06/2011 496532313208 496532313208 566040162150 566040162150 448414451191 448414451191
2 Rear registration plate lamp not working (1.1.c.1d) Rear registration plate lamp not working (1.1.c.1d) 08 June 2012 [15:09] 08/06/2012 16 February 2006 [13:16] 16/02/2006 566040162150 566040162150 830177146076 830177146076
2 Parking brake lever has no reserve travel (3.1.6b) Parking brake lever has no reserve travel (3.1.6b) 08 June 2012 [15:09] 08/06/2012 26 April 2010 [15:43] 26/04/2010 566040162150 566040162150 383056210158 383056210158
2 Nearside front wheel bearing has excessive play (2.5.a.3c) Nearside front wheel bearing has excessive play (2.5.a.3c) 29 April 2010 [14:13] 29/04/2010 18 March 2008 [15:02] 18/03/2008 502649510150 502649510150 242928878068 242928878068
2 Nearside front position lamp(s) not working (1.1.a.3b) Nearside front position lamp(s) not working (1.1.a.3b) 22 April 2009 [10:34] 22/04/2009 16 February 2006 [13:16] 16/02/2006 272182519476 272182519476 830177146076 830177146076
1 Indicator switch faulty (1.4.a.1) Indicator switch faulty (1.4.a.1) 31 July 2013 [09:46] 31/07/2013 496532313208 496532313208
1 Nearside front steering rack gaiter split (2.2.d.2d) Nearside front steering rack gaiter split (2.2.d.2d) 31 July 2013 [09:46] 31/07/2013 496532313208 496532313208
1 Suspension component mounting prescribed area is excessively corroded (2.4.a.3) Suspension component mounting prescribed area is excessively corroded (2.4.a.3) 31 July 2013 [09:46] 31/07/2013 496532313208 496532313208
1 Fuel cap/sealing device does not fasten securely maintaining the sealing arrangement (7.2.4b) Fuel cap/sealing device does not fasten securely maintaining the sealing arrangement (7.2.4b) 08 June 2012 [15:09] 08/06/2012 566040162150 566040162150
1 Nearside front steering rack gaiter insecure (2.2.d.2d) Nearside front steering rack gaiter insecure (2.2.d.2d) 08 June 2012 [15:09] 08/06/2012 566040162150 566040162150
1 Nearside front track rod end inappropriately modified (2.2.c.1e) Nearside front track rod end inappropriately modified (2.2.c.1e) 08 June 2012 [15:09] 08/06/2012 566040162150 566040162150
1 Offside front front wheel bearing has excessive play (2.5.a.3c) Offside front front wheel bearing has excessive play (2.5.a.3c) 08 June 2012 [15:09] 08/06/2012 566040162150 566040162150
1 Offside rear front wheel bearing has excessive play (2.5.a.3c) Offside rear front wheel bearing has excessive play (2.5.a.3c) 08 June 2012 [15:09] 08/06/2012 566040162150 566040162150
1 Brakes imbalanced across an axle (3.7.b.5b) Brakes imbalanced across an axle (3.7.b.5b) 08 June 2012 [15:09] 08/06/2012 566040162150 566040162150
1 Offside front wheel bearing has excessive play (2.5.a.3c) Offside front wheel bearing has excessive play (2.5.a.3c) 03 June 2011 [10:46] 03/06/2011 448414451191 448414451191
1 Nearside front front wheel bearing rough when rotated (2.5.a.2) Nearside front front wheel bearing rough when rotated (2.5.a.2) 29 April 2010 [14:13] 29/04/2010 502649510150 502649510150
1 Front wheel bearing rough when rotated (2.5.a.2) Front wheel bearing rough when rotated (2.5.a.2) 26 April 2010 [15:43] 26/04/2010 383056210158 383056210158
1 Steering rack gaiter split (2.2.d.2d) Steering rack gaiter split (2.2.d.2d) 26 April 2010 [15:43] 26/04/2010 383056210158 383056210158
1 Indicator tell tale inoperative (1.4.a.2a) Indicator tell tale inoperative (1.4.a.2a) 26 April 2010 [15:43] 26/04/2010 383056210158 383056210158
1 Rear position lamp(s) excessively deteriorated so that it is not visible from a reasonable distance (1.1.a.3d) Rear position lamp(s) excessively deteriorated so that it is not visible from a reasonable distance (1.1.a.3d) 22 April 2009 [10:34] 22/04/2009 272182519476 272182519476
1 Registration plate lamp not working (1.1.c.1d) Registration plate lamp not working (1.1.c.1d) 22 April 2009 [10:34] 22/04/2009 272182519476 272182519476
1 Stop lamp excessively damaged so that it is not visible from a reasonable distance (1.2.1d) Stop lamp excessively damaged so that it is not visible from a reasonable distance (1.2.1d) 18 March 2008 [15:02] 18/03/2008 242928878068 242928878068
1 Windscreen has a sticker or other obstruction encroaching by more than 10mm within zone 'a' (8.3.1b) Windscreen has a sticker or other obstruction encroaching by more than 10mm within zone 'a' (8.3.1b) 18 March 2008 [15:02] 18/03/2008 242928878068 242928878068
1 Horn not working (1.6.2a) Horn not working (1.6.2a) 16 February 2006 [13:16] 16/02/2006 830177146076 830177146076
1 Windscreen washer provides insufficient washer liquid (8.2.3) Windscreen washer provides insufficient washer liquid (8.2.3) 16 February 2006 [13:16] 16/02/2006 830177146076 830177146076
1 Nearside headlamp not working on main beam (1.7.5a) Nearside headlamp not working on main beam (1.7.5a) 16 February 2006 [13:16] 16/02/2006 830177146076 830177146076
1 Offside front shock absorber has a serious fluid leak (2.7.3) Offside front shock absorber has a serious fluid leak (2.7.3) 16 February 2006 [13:16] 16/02/2006 830177146076 830177146076
1 Suspension arm rubber bush deteriorated resulting in excessive movement (2.4.g.2) Suspension arm rubber bush deteriorated resulting in excessive movement (2.4.g.2) 16 February 2006 [13:16] 16/02/2006 830177146076 830177146076
1 Brake lever has restricted free movement (3.5.1k) Brake lever has restricted free movement (3.5.1k) 16 February 2006 [13:16] 16/02/2006 830177146076 830177146076
1 Exhaust has a major leak of exhaust gases (7.1.2) Exhaust has a major leak of exhaust gases (7.1.2) 16 February 2006 [13:16] 16/02/2006 830177146076 830177146076
1 Body or chassis has excessive corrosion, seriously affecting its strength within 30cm of the body mountings (6.1.b.2) Body or chassis has excessive corrosion, seriously affecting its strength within 30cm of the body mountings (6.1.b.2) 16 February 2006 [13:16] 16/02/2006 830177146076 830177146076

ALL 423 WYD User Entered Faults [14]

ALL User Entered faults, ORDERED by OCCURRENCE DURING 423 WYD's MOT HISTORY
ALL 423 WYD User Entered Faults [14]
ALL User Entered faults, ORDERED by OCCURRENCE DURING 423 WYD's MOT HISTORY
Advisory Faults | source www.vehiclestats.co.uk
Fault Fault Test Date Test Date/Time Reference MOT Test Reference
2 Well & truly under seald ? Well & truly under seald ? 03 June 2011 [12:50] 03/06/2011 03 June 2011 [10:46] 03/06/2011 479174551137 479174551137 448414451191 448414451191
2 Front number plate designed to be easily removed Front number plate designed to be easily removed 20 March 2008 [16:40] 20/03/2008 18 March 2008 [15:02] 18/03/2008 993400888009 993400888009 242928878068 242928878068
2 Unable to satisfy condition of brake pipes due to covering of grease Unable to satisfy condition of brake pipes due to covering of grease 20 March 2008 [16:40] 20/03/2008 18 March 2008 [15:02] 18/03/2008 993400888009 993400888009 242928878068 242928878068
1 Well undersealed Well undersealed 30 August 2013 [09:38] 30/08/2013 365132743271 365132743271
1 Underseal and grease make it impossible to check corrossion ? Underseal and grease make it impossible to check corrossion ? 31 July 2013 [09:46] 31/07/2013 496532313208 496532313208
1 Well & truly undersealed ? Well & truly undersealed ? 07 May 2010 [09:45] 07/05/2010 220427020146 220427020146
1 Slightly long foot travel / Slightly long foot travel / 07 May 2010 [09:45] 07/05/2010 220427020146 220427020146
1 This vehicle is well & truly under sealed ? This vehicle is well & truly under sealed ? 29 April 2010 [14:13] 29/04/2010 502649510150 502649510150
1 Rear lights pass test but is there a bulb in wrong ? Rear lights pass test but is there a bulb in wrong ? 26 April 2010 [15:43] 26/04/2010 383056210158 383056210158
1 Propshaft defective Propshaft defective 16 February 2006 [13:16] 16/02/2006 830177146076 830177146076
1 Slight wear in o/s steering rack Slight wear in o/s steering rack 16 February 2006 [13:16] 16/02/2006 830177146076 830177146076

ALL 423 WYD Pass With Rectification Faults [4]

ALL Pass With Rectification faults, ORDERED by OCCURRENCE DURING 423 WYD's MOT HISTORY
ALL 423 WYD Pass With Rectification Faults [4]
ALL Pass With Rectification faults, ORDERED by OCCURRENCE DURING 423 WYD's MOT HISTORY
Pass With Rectification Faults | source www.vehiclestats.co.uk
Fault Fault Test Date Test Date/Time Reference MOT Test Reference
1 Nearside seat belt retracting mechanism defective (5.2.5b) Nearside seat belt retracting mechanism defective (5.2.5b) 10 March 2007 [08:44] 10/03/2007 751009167093 751009167093
1 Offside seat belt retracting mechanism defective (5.2.5b) Offside seat belt retracting mechanism defective (5.2.5b) 10 March 2007 [08:44] 10/03/2007 751009167093 751009167093
1 Nearside headlamp not working on dipped beam (1.7.5a) Nearside headlamp not working on dipped beam (1.7.5a) 10 March 2007 [08:44] 10/03/2007 751009167093 751009167093
1 Parking brake lever has no reserve travel (3.1.6b) Parking brake lever has no reserve travel (3.1.6b) 10 March 2007 [08:44] 10/03/2007 751009167093 751009167093

MOT TEST: 30 August 2013 09:38:22 PASSED
MOT TEST: 30 August 2013 09:38:22 PASSED

This test (365132743271) was completed on the 30 August 2013 09:38:22 and PASSED the requirements for a valid MOT with 1 comments.

This test (365132743271) was completed on the 30 August 2013 09:38:22 and PASSED the requirements for a valid MOT with 1 comments.

Recorded mileage: 61,555

Recorded mileage: 61,555


USER ENTERED


MOT TEST: 31 July 2013 09:46:44 FAILED
MOT TEST: 31 July 2013 09:46:44 FAILED

This test (496532313208) was completed on the 31 July 2013 09:46:44 and FAILED the requirements for a valid MOT with 6 comments.

This test (496532313208) was completed on the 31 July 2013 09:46:44 and FAILED the requirements for a valid MOT with 6 comments.

Recorded mileage: 61,555

Recorded mileage: 61,555


FAIL

USER ENTERED


MOT TEST: 22 June 2012 16:00:09 PASSED
MOT TEST: 22 June 2012 16:00:09 PASSED

This test (759294272186) was completed on the 22 June 2012 16:00:09 and PASSED the requirements for a valid MOT with 4 comments.

This test (759294272186) was completed on the 22 June 2012 16:00:09 and PASSED the requirements for a valid MOT with 4 comments.

Recorded mileage: 615,564

Recorded mileage: 615,564


ADVISORY


MOT TEST: 08 June 2012 15:09:10 FAILED
MOT TEST: 08 June 2012 15:09:10 FAILED

This test (566040162150) was completed on the 08 June 2012 15:09:10 and FAILED the requirements for a valid MOT with 14 comments.

This test (566040162150) was completed on the 08 June 2012 15:09:10 and FAILED the requirements for a valid MOT with 14 comments.

Recorded mileage: 615,559

Recorded mileage: 615,559


ADVISORY

FAIL


MOT TEST: 03 June 2011 12:50:37 PASSED
MOT TEST: 03 June 2011 12:50:37 PASSED

This test (479174551137) was completed on the 03 June 2011 12:50:37 and PASSED the requirements for a valid MOT with 2 comments.

This test (479174551137) was completed on the 03 June 2011 12:50:37 and PASSED the requirements for a valid MOT with 2 comments.

Recorded mileage: 61,555

Recorded mileage: 61,555


ADVISORY

USER ENTERED


MOT TEST: 03 June 2011 10:46:02 FAILED
MOT TEST: 03 June 2011 10:46:02 FAILED

This test (448414451191) was completed on the 03 June 2011 10:46:02 and FAILED the requirements for a valid MOT with 4 comments.

This test (448414451191) was completed on the 03 June 2011 10:46:02 and FAILED the requirements for a valid MOT with 4 comments.

Recorded mileage: 61,555

Recorded mileage: 61,555


FAIL

USER ENTERED


MOT TEST: 07 May 2010 09:45:49 PASSED
MOT TEST: 07 May 2010 09:45:49 PASSED

This test (220427020146) was completed on the 07 May 2010 09:45:49 and PASSED the requirements for a valid MOT with 3 comments.

This test (220427020146) was completed on the 07 May 2010 09:45:49 and PASSED the requirements for a valid MOT with 3 comments.

Recorded mileage: 61,555

Recorded mileage: 61,555


ADVISORY

USER ENTERED


MOT TEST: 29 April 2010 14:13:49 FAILED
MOT TEST: 29 April 2010 14:13:49 FAILED

This test (502649510150) was completed on the 29 April 2010 14:13:49 and FAILED the requirements for a valid MOT with 3 comments.

This test (502649510150) was completed on the 29 April 2010 14:13:49 and FAILED the requirements for a valid MOT with 3 comments.

Recorded mileage: 0

Recorded mileage: 0


FAIL

USER ENTERED


MOT TEST: 26 April 2010 15:43:30 FAILED
MOT TEST: 26 April 2010 15:43:30 FAILED

This test (383056210158) was completed on the 26 April 2010 15:43:30 and FAILED the requirements for a valid MOT with 6 comments.

This test (383056210158) was completed on the 26 April 2010 15:43:30 and FAILED the requirements for a valid MOT with 6 comments.

Recorded mileage: 61,555

Recorded mileage: 61,555


FAIL

USER ENTERED


MOT TEST: 22 April 2009 15:48:06 PASSED
MOT TEST: 22 April 2009 15:48:06 PASSED

This test (943262919120) was completed on the 22 April 2009 15:48:06 and PASSED the requirements for a valid MOT with 0 comments.

This test (943262919120) was completed on the 22 April 2009 15:48:06 and PASSED the requirements for a valid MOT with 0 comments.

Recorded mileage: 59,620

Recorded mileage: 59,620


MOT TEST: 22 April 2009 10:34:21 FAILED
MOT TEST: 22 April 2009 10:34:21 FAILED

This test (272182519476) was completed on the 22 April 2009 10:34:21 and FAILED the requirements for a valid MOT with 3 comments.

This test (272182519476) was completed on the 22 April 2009 10:34:21 and FAILED the requirements for a valid MOT with 3 comments.

Recorded mileage: 59,620

Recorded mileage: 59,620


FAIL


MOT TEST: 20 March 2008 16:40:16 PASSED
MOT TEST: 20 March 2008 16:40:16 PASSED

This test (993400888009) was completed on the 20 March 2008 16:40:16 and PASSED the requirements for a valid MOT with 2 comments.

This test (993400888009) was completed on the 20 March 2008 16:40:16 and PASSED the requirements for a valid MOT with 2 comments.

Recorded mileage: 59,621

Recorded mileage: 59,621


USER ENTERED


MOT TEST: 18 March 2008 15:02:38 FAILED
MOT TEST: 18 March 2008 15:02:38 FAILED

This test (242928878068) was completed on the 18 March 2008 15:02:38 and FAILED the requirements for a valid MOT with 5 comments.

This test (242928878068) was completed on the 18 March 2008 15:02:38 and FAILED the requirements for a valid MOT with 5 comments.

Recorded mileage: 59,620

Recorded mileage: 59,620


FAIL

USER ENTERED


MOT TEST: 10 March 2007 12:10:00 PASSED
MOT TEST: 10 March 2007 12:10:00 PASSED

This test (790479167035) was completed on the 10 March 2007 12:10:00 and PASSED the requirements for a valid MOT with 0 comments.

This test (790479167035) was completed on the 10 March 2007 12:10:00 and PASSED the requirements for a valid MOT with 0 comments.

Recorded mileage: 58,206

Recorded mileage: 58,206


MOT TEST: 10 March 2007 08:44:47 FAILED
MOT TEST: 10 March 2007 08:44:47 FAILED

This test (751009167093) was completed on the 10 March 2007 08:44:47 and FAILED the requirements for a valid MOT with 6 comments.

This test (751009167093) was completed on the 10 March 2007 08:44:47 and FAILED the requirements for a valid MOT with 6 comments.

Recorded mileage: 58,206

Recorded mileage: 58,206


ADVISORY

FAIL

PASS WITH RECTIFICATION


MOT TEST: 03 March 2006 12:52:31 PASSED
MOT TEST: 03 March 2006 12:52:31 PASSED

This test (180322566452) was completed on the 03 March 2006 12:52:31 and PASSED the requirements for a valid MOT with 0 comments.

This test (180322566452) was completed on the 03 March 2006 12:52:31 and PASSED the requirements for a valid MOT with 0 comments.

Recorded mileage: 57,665

Recorded mileage: 57,665


MOT TEST: 16 February 2006 13:16:22 FAILED
MOT TEST: 16 February 2006 13:16:22 FAILED

This test (830177146076) was completed on the 16 February 2006 13:16:22 and FAILED the requirements for a valid MOT with 15 comments.

This test (830177146076) was completed on the 16 February 2006 13:16:22 and FAILED the requirements for a valid MOT with 15 comments.

Recorded mileage: 57,663

Recorded mileage: 57,663


FAIL

USER ENTERED