424 UXH


424UXH is registered to a Blue 1971, Morris Minor 1000 with a Petrol engine. It Failed its most recent MOT Test on the 17 June 2015

9 unique faults (10 Total) reported in its MOT History (13 Tests).

1 common/recurring faults.

77% (10) MOT Pass Rate and a 23% (3) MOT Failure Rate.

87,308 recorded miles.

424 UXH


424UXH is registered to a Blue 1971, Morris Minor 1000 with a Petrol engine. It Failed its most recent MOT Test on the 17 June 2015

9 unique faults (10 Total) reported in its MOT History (13 Tests).

1 common/recurring faults.

77% (10) MOT Pass Rate and a 23% (3) MOT Failure Rate.

87,308 recorded miles.

MOT PASS/Failure rate for 424 UXH

all MOT test results for 424 UXH represented as a percentage
MOT PASS/Failure rate for 424 UXH
all MOT test results for 424 UXH represented as a percentage

PERCENTAGE OF VEHICLE FAULTS WITH 424 UXH

ALL REPORTED FAULTS, DISPLAYED BY PERCENTAGE OF OCCURRENCE DURING ALL MOT TESTS
PERCENTAGE OF VEHICLE FAULTS WITH 424 UXH
ALL REPORTED FAULTS, DISPLAYED BY PERCENTAGE OF OCCURRENCE DURING ALL MOT TESTS
ADVISORY

FAIL

USER ENTERED

PASS WITH RECTIFICATION

424 UXH annual Faults by type

ALL REPORTED FAULTS, DISPLAYED over time and categorised by type
424 UXH annual Faults by type
ALL REPORTED FAULTS, DISPLAYED over time and categorised by type

ALL 424 UXH ADVISORIES [1]

ALL ADVISORIES, ORDERED by OCCURRENCE DURING 424 UXH's MOT HISTORY
ALL 424 UXH ADVISORIES [1]
ALL ADVISORIES, ORDERED by OCCURRENCE DURING 424 UXH's MOT HISTORY
Advisory Faults | source www.vehiclestats.co.uk
Fault Fault Test Date Test Date/Time Reference MOT Test Reference
1 Nearside front lower suspension arm has slight play in a pin/bearing (2.4.g.2) Nearside front lower suspension arm has slight play in a pin/bearing (2.4.g.2) 18 June 2013 [12:24] 18/06/2013 185159263141 185159263141

ALL 424 UXH Failure Faults [5]

ALL Failure faults, ORDERED by OCCURRENCE DURING 424 UXH's MOT HISTORY
ALL 424 UXH Failure Faults [5]
ALL Failure faults, ORDERED by OCCURRENCE DURING 424 UXH's MOT HISTORY
Fail Faults | source www.vehiclestats.co.uk
Fault Fault Test Date Test Date/Time Reference MOT Test Reference
1 Nearside front position lamp(s) not working (1.1.a.3b) Nearside front position lamp(s) not working (1.1.a.3b) 21 April 2008 [11:50] 21/04/2008 124112018165 124112018165
1 Offside rear suspension component mounting prescribed area is excessively corroded (2.4.a.3) Offside rear suspension component mounting prescribed area is excessively corroded (2.4.a.3) 21 April 2008 [11:50] 21/04/2008 124112018165 124112018165
1 Offside front brake master cylinder/servo mounting prescribed area is excessively corroded (3.6.c.3) Offside front brake master cylinder/servo mounting prescribed area is excessively corroded (3.6.c.3) 24 July 2007 [12:51] 24/07/2007 961625307278 961625307278
1 Nearside front brake juddering severely (3.7.a.2b) Nearside front brake juddering severely (3.7.a.2b) 24 July 2007 [12:51] 24/07/2007 961625307278 961625307278
1 Nearside front brake binding (3.7.b.1) Nearside front brake binding (3.7.b.1) 24 July 2007 [12:51] 24/07/2007 961625307278 961625307278

ALL 424 UXH User Entered Faults [3]

ALL User Entered faults, ORDERED by OCCURRENCE DURING 424 UXH's MOT HISTORY
ALL 424 UXH User Entered Faults [3]
ALL User Entered faults, ORDERED by OCCURRENCE DURING 424 UXH's MOT HISTORY
User Entered Faults | source www.vehiclestats.co.uk
Fault Fault Test Date Test Date/Time Reference MOT Test Reference
2 R/o/s s/absorber slight leal R/o/s s/absorber slight leal 24 April 2008 [16:05] 24/04/2008 21 April 2008 [11:50] 21/04/2008 781225118146 781225118146 124112018165 124112018165
1 R/n/s tyre outer wall slightly perished /wheel rim slightly damaged R/n/s tyre outer wall slightly perished /wheel rim slightly damaged 21 April 2008 [11:50] 21/04/2008 124112018165 124112018165

ALL 424 UXH Pass With Rectification Faults [1]

ALL Pass With Rectification faults, ORDERED by OCCURRENCE DURING 424 UXH's MOT HISTORY
ALL 424 UXH Pass With Rectification Faults [1]
ALL Pass With Rectification faults, ORDERED by OCCURRENCE DURING 424 UXH's MOT HISTORY
Pass With Rectification Faults | source www.vehiclestats.co.uk
Fault Fault Test Date Test Date/Time Reference MOT Test Reference
1 Offside stop lamp not working (1.2.1b) Offside stop lamp not working (1.2.1b) 06 June 2012 [15:12] 06/06/2012 667898952192 667898952192

MOT TEST: 17 June 2015 11:34:18 PASSED
MOT TEST: 17 June 2015 11:34:18 PASSED

This test (288188765476) was completed on the 17 June 2015 11:34:18 and PASSED the requirements for a valid MOT with 0 comments.

This test (288188765476) was completed on the 17 June 2015 11:34:18 and PASSED the requirements for a valid MOT with 0 comments.

Recorded mileage: 87,308

Recorded mileage: 87,308


MOT TEST: 11 June 2014 11:34:27 PASSED
MOT TEST: 11 June 2014 11:34:27 PASSED

This test (535092164188) was completed on the 11 June 2014 11:34:27 and PASSED the requirements for a valid MOT with 0 comments.

This test (535092164188) was completed on the 11 June 2014 11:34:27 and PASSED the requirements for a valid MOT with 0 comments.

Recorded mileage: 87,297

Recorded mileage: 87,297


MOT TEST: 18 June 2013 12:24:12 PASSED
MOT TEST: 18 June 2013 12:24:12 PASSED

This test (185159263141) was completed on the 18 June 2013 12:24:12 and PASSED the requirements for a valid MOT with 1 comments.

This test (185159263141) was completed on the 18 June 2013 12:24:12 and PASSED the requirements for a valid MOT with 1 comments.

Recorded mileage: 87,273

Recorded mileage: 87,273


ADVISORY


MOT TEST: 06 June 2012 15:12:15 PASSED
MOT TEST: 06 June 2012 15:12:15 PASSED

This test (318808652160) was completed on the 06 June 2012 15:12:15 and PASSED the requirements for a valid MOT with 0 comments.

This test (318808652160) was completed on the 06 June 2012 15:12:15 and PASSED the requirements for a valid MOT with 0 comments.

Recorded mileage: 87,265

Recorded mileage: 87,265


MOT TEST: 06 June 2012 15:12:15 FAILED
MOT TEST: 06 June 2012 15:12:15 FAILED

This test (667898952192) was completed on the 06 June 2012 15:12:15 and FAILED the requirements for a valid MOT with 1 comments.

This test (667898952192) was completed on the 06 June 2012 15:12:15 and FAILED the requirements for a valid MOT with 1 comments.

Recorded mileage: 87,265

Recorded mileage: 87,265


PASS WITH RECTIFICATION


MOT TEST: 26 May 2011 14:59:37 PASSED
MOT TEST: 26 May 2011 14:59:37 PASSED

This test (216956341182) was completed on the 26 May 2011 14:59:37 and PASSED the requirements for a valid MOT with 0 comments.

This test (216956341182) was completed on the 26 May 2011 14:59:37 and PASSED the requirements for a valid MOT with 0 comments.

Recorded mileage: 87,253

Recorded mileage: 87,253


MOT TEST: 08 June 2010 08:33:44 PASSED
MOT TEST: 08 June 2010 08:33:44 PASSED

This test (101519250172) was completed on the 08 June 2010 08:33:44 and PASSED the requirements for a valid MOT with 0 comments.

This test (101519250172) was completed on the 08 June 2010 08:33:44 and PASSED the requirements for a valid MOT with 0 comments.

Recorded mileage: 87,243

Recorded mileage: 87,243


MOT TEST: 24 June 2009 09:41:00 PASSED
MOT TEST: 24 June 2009 09:41:00 PASSED

This test (514145979135) was completed on the 24 June 2009 09:41:00 and PASSED the requirements for a valid MOT with 0 comments.

This test (514145979135) was completed on the 24 June 2009 09:41:00 and PASSED the requirements for a valid MOT with 0 comments.

Recorded mileage: 87,171

Recorded mileage: 87,171


MOT TEST: 24 April 2008 16:05:10 PASSED
MOT TEST: 24 April 2008 16:05:10 PASSED

This test (781225118146) was completed on the 24 April 2008 16:05:10 and PASSED the requirements for a valid MOT with 1 comments.

This test (781225118146) was completed on the 24 April 2008 16:05:10 and PASSED the requirements for a valid MOT with 1 comments.

Recorded mileage: 86,921

Recorded mileage: 86,921


USER ENTERED


MOT TEST: 21 April 2008 11:50:53 FAILED
MOT TEST: 21 April 2008 11:50:53 FAILED

This test (124112018165) was completed on the 21 April 2008 11:50:53 and FAILED the requirements for a valid MOT with 4 comments.

This test (124112018165) was completed on the 21 April 2008 11:50:53 and FAILED the requirements for a valid MOT with 4 comments.

Recorded mileage: 86,812

Recorded mileage: 86,812


FAIL

USER ENTERED


MOT TEST: 06 August 2007 18:36:30 PASSED
MOT TEST: 06 August 2007 18:36:30 PASSED

This test (771278917285) was completed on the 06 August 2007 18:36:30 and PASSED the requirements for a valid MOT with 0 comments.

This test (771278917285) was completed on the 06 August 2007 18:36:30 and PASSED the requirements for a valid MOT with 0 comments.

Recorded mileage: 86,027

Recorded mileage: 86,027


MOT TEST: 24 July 2007 12:51:15 FAILED
MOT TEST: 24 July 2007 12:51:15 FAILED

This test (961625307278) was completed on the 24 July 2007 12:51:15 and FAILED the requirements for a valid MOT with 3 comments.

This test (961625307278) was completed on the 24 July 2007 12:51:15 and FAILED the requirements for a valid MOT with 3 comments.

Recorded mileage: 86,016

Recorded mileage: 86,016


FAIL


MOT TEST: 26 July 2006 13:13:56 PASSED
MOT TEST: 26 July 2006 13:13:56 PASSED

This test (660367606253) was completed on the 26 July 2006 13:13:56 and PASSED the requirements for a valid MOT with 0 comments.

This test (660367606253) was completed on the 26 July 2006 13:13:56 and PASSED the requirements for a valid MOT with 0 comments.

Recorded mileage: 84,755

Recorded mileage: 84,755