425 CKK


425CKK is registered to a Black 1958, Morris Oxford with a Petrol engine. It Failed its most recent MOT Test on the 09 November 2012

4 unique faults (4 Total) reported in its MOT History (3 Tests).

0 common/recurring faults.

67% (2) MOT Pass Rate and a 33% (1) MOT Failure Rate.

8,724 recorded miles.

425 CKK


425CKK is registered to a Black 1958, Morris Oxford with a Petrol engine. It Failed its most recent MOT Test on the 09 November 2012

4 unique faults (4 Total) reported in its MOT History (3 Tests).

0 common/recurring faults.

67% (2) MOT Pass Rate and a 33% (1) MOT Failure Rate.

8,724 recorded miles.

MOT PASS/Failure rate for 425 CKK

all MOT test results for 425 CKK represented as a percentage
MOT PASS/Failure rate for 425 CKK
all MOT test results for 425 CKK represented as a percentage

PERCENTAGE OF VEHICLE FAULTS WITH 425 CKK

ALL REPORTED FAULTS, DISPLAYED BY PERCENTAGE OF OCCURRENCE DURING ALL MOT TESTS
PERCENTAGE OF VEHICLE FAULTS WITH 425 CKK
ALL REPORTED FAULTS, DISPLAYED BY PERCENTAGE OF OCCURRENCE DURING ALL MOT TESTS
FAIL

USER ENTERED

425 CKK annual Faults by type

ALL REPORTED FAULTS, DISPLAYED over time and categorised by type
425 CKK annual Faults by type
ALL REPORTED FAULTS, DISPLAYED over time and categorised by type

ALL 425 CKK Failure Faults [2]

ALL Failure faults, ORDERED by OCCURRENCE DURING 425 CKK's MOT HISTORY
ALL 425 CKK Failure Faults [2]
ALL Failure faults, ORDERED by OCCURRENCE DURING 425 CKK's MOT HISTORY
Fail Faults | source www.vehiclestats.co.uk
Fault Fault Test Date Test Date/Time Reference MOT Test Reference
1 Offside headlamp not working on dipped beam (1.7.5a) Offside headlamp not working on dipped beam (1.7.5a) 31 October 2011 [14:59] 31/10/2011 328204301335 328204301335
1 Offside headlamp not working on main beam (1.7.5a) Offside headlamp not working on main beam (1.7.5a) 31 October 2011 [14:59] 31/10/2011 328204301335 328204301335

ALL 425 CKK User Entered Faults [2]

ALL User Entered faults, ORDERED by OCCURRENCE DURING 425 CKK's MOT HISTORY
ALL 425 CKK User Entered Faults [2]
ALL User Entered faults, ORDERED by OCCURRENCE DURING 425 CKK's MOT HISTORY
User Entered Faults | source www.vehiclestats.co.uk
Fault Fault Test Date Test Date/Time Reference MOT Test Reference
1 Both front brake metal pipes, between wheel cylinders , becomming corrodded Both front brake metal pipes, between wheel cylinders , becomming corrodded 09 November 2012 [10:31] 09/11/2012 245274812302 245274812302
1 Nearside front wheel bearing becomming noisey Nearside front wheel bearing becomming noisey 09 November 2012 [10:31] 09/11/2012 245274812302 245274812302

MOT TEST: 09 November 2012 10:31:14 PASSED
MOT TEST: 09 November 2012 10:31:14 PASSED

This test (245274812302) was completed on the 09 November 2012 10:31:14 and PASSED the requirements for a valid MOT with 2 comments.

This test (245274812302) was completed on the 09 November 2012 10:31:14 and PASSED the requirements for a valid MOT with 2 comments.

Recorded mileage: 8,724

Recorded mileage: 8,724


USER ENTERED


MOT TEST: 31 October 2011 16:17:04 PASSED
MOT TEST: 31 October 2011 16:17:04 PASSED

This test (497374901439) was completed on the 31 October 2011 16:17:04 and PASSED the requirements for a valid MOT with 0 comments.

This test (497374901439) was completed on the 31 October 2011 16:17:04 and PASSED the requirements for a valid MOT with 0 comments.

Recorded mileage: 7,574

Recorded mileage: 7,574


MOT TEST: 31 October 2011 14:59:02 FAILED
MOT TEST: 31 October 2011 14:59:02 FAILED

This test (328204301335) was completed on the 31 October 2011 14:59:02 and FAILED the requirements for a valid MOT with 2 comments.

This test (328204301335) was completed on the 31 October 2011 14:59:02 and FAILED the requirements for a valid MOT with 2 comments.

Recorded mileage: 7,572

Recorded mileage: 7,572


FAIL