425 UXS


425UXS is registered to a Grey 1960, Morris Minor 1000 with a Petrol engine. It Failed its most recent MOT Test on the 02 June 2017

18 unique faults (18 Total) reported in its MOT History (4 Tests).

0 common/recurring faults.

75% (3) MOT Pass Rate and a 25% (1) MOT Failure Rate.

30,179 recorded miles.

425 UXS


425UXS is registered to a Grey 1960, Morris Minor 1000 with a Petrol engine. It Failed its most recent MOT Test on the 02 June 2017

18 unique faults (18 Total) reported in its MOT History (4 Tests).

0 common/recurring faults.

75% (3) MOT Pass Rate and a 25% (1) MOT Failure Rate.

30,179 recorded miles.

MOT PASS/Failure rate for 425 UXS

all MOT test results for 425 UXS represented as a percentage
MOT PASS/Failure rate for 425 UXS
all MOT test results for 425 UXS represented as a percentage

PERCENTAGE OF VEHICLE FAULTS WITH 425 UXS

ALL REPORTED FAULTS, DISPLAYED BY PERCENTAGE OF OCCURRENCE DURING ALL MOT TESTS
PERCENTAGE OF VEHICLE FAULTS WITH 425 UXS
ALL REPORTED FAULTS, DISPLAYED BY PERCENTAGE OF OCCURRENCE DURING ALL MOT TESTS
ADVISORY

FAIL

USER ENTERED

425 UXS annual Faults by type

ALL REPORTED FAULTS, DISPLAYED over time and categorised by type
425 UXS annual Faults by type
ALL REPORTED FAULTS, DISPLAYED over time and categorised by type

ALL 425 UXS ADVISORIES [4]

ALL ADVISORIES, ORDERED by OCCURRENCE DURING 425 UXS's MOT HISTORY
ALL 425 UXS ADVISORIES [4]
ALL ADVISORIES, ORDERED by OCCURRENCE DURING 425 UXS's MOT HISTORY
Advisory Faults | source www.vehiclestats.co.uk
Fault Fault Test Date Test Date/Time Reference MOT Test Reference
1 Nearside front wheel bearing has slight play (2.5.a.3c) Nearside front wheel bearing has slight play (2.5.a.3c) 02 June 2017 [09:58] 02/06/2017 993441339023 993441339023
1 Offside front wheel bearing has slight play (2.5.a.3c) Offside front wheel bearing has slight play (2.5.a.3c) 02 June 2017 [09:58] 02/06/2017 993441339023 993441339023
1 Nearside front upper suspension arm has slight play in a pin/bush (2.4.g.2) Nearside front upper suspension arm has slight play in a pin/bush (2.4.g.2) 02 June 2017 [09:58] 02/06/2017 993441339023 993441339023
1 Rear exhaust has a minor leak of exhaust gases (7.1.2) Rear exhaust has a minor leak of exhaust gases (7.1.2) 02 June 2017 [09:58] 02/06/2017 993441339023 993441339023

ALL 425 UXS Failure Faults [13]

ALL Failure faults, ORDERED by OCCURRENCE DURING 425 UXS's MOT HISTORY
ALL 425 UXS Failure Faults [13]
ALL Failure faults, ORDERED by OCCURRENCE DURING 425 UXS's MOT HISTORY
Fail Faults | source www.vehiclestats.co.uk
Fault Fault Test Date Test Date/Time Reference MOT Test Reference
1 Offside front lower front suspension has excessive play in a lower suspension ball joint (2.5.b.1a) Offside front lower front suspension has excessive play in a lower suspension ball joint (2.5.b.1a) 23 November 2006 [15:41] 23/11/2006 424807126327 424807126327
1 Nearside front upper front suspension has excessive play in a upper suspension ball joint (2.5.b.1a) Nearside front upper front suspension has excessive play in a upper suspension ball joint (2.5.b.1a) 23 November 2006 [15:41] 23/11/2006 424807126327 424807126327
1 Nearside front lower front suspension has excessive play in a lower suspension ball joint (2.5.b.1a) Nearside front lower front suspension has excessive play in a lower suspension ball joint (2.5.b.1a) 23 November 2006 [15:41] 23/11/2006 424807126327 424807126327
1 Nearside seat belt anchorage prescribed area is excessively corroded (5.2.6) Nearside seat belt anchorage prescribed area is excessively corroded (5.2.6) 23 November 2006 [15:41] 23/11/2006 424807126327 424807126327
1 Offside seat belt anchorage prescribed area is excessively corroded (5.2.6) Offside seat belt anchorage prescribed area is excessively corroded (5.2.6) 23 November 2006 [15:41] 23/11/2006 424807126327 424807126327
1 Offside rear seat belt anchorage prescribed area is excessively corroded (5.2.6) Offside rear seat belt anchorage prescribed area is excessively corroded (5.2.6) 23 November 2006 [15:41] 23/11/2006 424807126327 424807126327
1 Nearside front headlamp not working on dipped beam (1.7.5a) Nearside front headlamp not working on dipped beam (1.7.5a) 23 November 2006 [15:41] 23/11/2006 424807126327 424807126327
1 Nearside rear stop lamp not working (1.2.1b) Nearside rear stop lamp not working (1.2.1b) 23 November 2006 [15:41] 23/11/2006 424807126327 424807126327
1 Nearside rear direction indicator not working (1.4.a.2c) Nearside rear direction indicator not working (1.4.a.2c) 23 November 2006 [15:41] 23/11/2006 424807126327 424807126327
1 Front brake application uneven (3.7.b.2) Front brake application uneven (3.7.b.2) 23 November 2006 [15:41] 23/11/2006 424807126327 424807126327
1 Front brakes release unevenly (3.7.b.4) Front brakes release unevenly (3.7.b.4) 23 November 2006 [15:41] 23/11/2006 424807126327 424807126327
1 Offside rear parking brake recording little or no effort (3.7.b.6a) Offside rear parking brake recording little or no effort (3.7.b.6a) 23 November 2006 [15:41] 23/11/2006 424807126327 424807126327
1 Parking brake: efficiency below requirements (3.7.c.1b) Parking brake: efficiency below requirements (3.7.c.1b) 23 November 2006 [15:41] 23/11/2006 424807126327 424807126327

ALL 425 UXS User Entered Faults [1]

ALL User Entered faults, ORDERED by OCCURRENCE DURING 425 UXS's MOT HISTORY
ALL 425 UXS User Entered Faults [1]
ALL User Entered faults, ORDERED by OCCURRENCE DURING 425 UXS's MOT HISTORY
User Entered Faults | source www.vehiclestats.co.uk
Fault Fault Test Date Test Date/Time Reference MOT Test Reference
1 Offside front upper and lower trongens have slight play Offside front upper and lower trongens have slight play 12 September 2014 [11:59] 12/09/2014 848115854200 848115854200

MOT TEST: 02 June 2017 09:58:27 PASSED
MOT TEST: 02 June 2017 09:58:27 PASSED

This test (993441339023) was completed on the 02 June 2017 09:58:27 and PASSED the requirements for a valid MOT with 4 comments.

This test (993441339023) was completed on the 02 June 2017 09:58:27 and PASSED the requirements for a valid MOT with 4 comments.

Recorded mileage: 30,179

Recorded mileage: 30,179


ADVISORY


MOT TEST: 12 September 2014 11:59:22 PASSED
MOT TEST: 12 September 2014 11:59:22 PASSED

This test (848115854200) was completed on the 12 September 2014 11:59:22 and PASSED the requirements for a valid MOT with 1 comments.

This test (848115854200) was completed on the 12 September 2014 11:59:22 and PASSED the requirements for a valid MOT with 1 comments.

Recorded mileage: 29,871

Recorded mileage: 29,871


USER ENTERED


MOT TEST: 28 November 2006 12:53:19 PASSED
MOT TEST: 28 November 2006 12:53:19 PASSED

This test (760382036368) was completed on the 28 November 2006 12:53:19 and PASSED the requirements for a valid MOT with 0 comments.

This test (760382036368) was completed on the 28 November 2006 12:53:19 and PASSED the requirements for a valid MOT with 0 comments.

Recorded mileage: 24,908

Recorded mileage: 24,908


MOT TEST: 23 November 2006 15:41:24 FAILED
MOT TEST: 23 November 2006 15:41:24 FAILED

This test (424807126327) was completed on the 23 November 2006 15:41:24 and FAILED the requirements for a valid MOT with 13 comments.

This test (424807126327) was completed on the 23 November 2006 15:41:24 and FAILED the requirements for a valid MOT with 13 comments.

Recorded mileage: 24,893

Recorded mileage: 24,893


FAIL