426 NKT


426NKT is registered to a Black 1961, Morris Minor 1000 with a Petrol engine. It Failed its most recent MOT Test on the 16 September 2017

9 unique faults (9 Total) reported in its MOT History (8 Tests).

0 common/recurring faults.

88% (7) MOT Pass Rate and a 12% (1) MOT Failure Rate.

11,064 recorded miles.

426 NKT


426NKT is registered to a Black 1961, Morris Minor 1000 with a Petrol engine. It Failed its most recent MOT Test on the 16 September 2017

9 unique faults (9 Total) reported in its MOT History (8 Tests).

0 common/recurring faults.

88% (7) MOT Pass Rate and a 12% (1) MOT Failure Rate.

11,064 recorded miles.

MOT PASS/Failure rate for 426 NKT

all MOT test results for 426 NKT represented as a percentage
MOT PASS/Failure rate for 426 NKT
all MOT test results for 426 NKT represented as a percentage

PERCENTAGE OF VEHICLE FAULTS WITH 426 NKT

ALL REPORTED FAULTS, DISPLAYED BY PERCENTAGE OF OCCURRENCE DURING ALL MOT TESTS
PERCENTAGE OF VEHICLE FAULTS WITH 426 NKT
ALL REPORTED FAULTS, DISPLAYED BY PERCENTAGE OF OCCURRENCE DURING ALL MOT TESTS
ADVISORY

FAIL

USER ENTERED

426 NKT annual Faults by type

ALL REPORTED FAULTS, DISPLAYED over time and categorised by type
426 NKT annual Faults by type
ALL REPORTED FAULTS, DISPLAYED over time and categorised by type

ALL 426 NKT ADVISORIES [1]

ALL ADVISORIES, ORDERED by OCCURRENCE DURING 426 NKT's MOT HISTORY
ALL 426 NKT ADVISORIES [1]
ALL ADVISORIES, ORDERED by OCCURRENCE DURING 426 NKT's MOT HISTORY
Advisory Faults | source www.vehiclestats.co.uk
Fault Fault Test Date Test Date/Time Reference MOT Test Reference
1 Offside steering rack gaiter deteriorated (2.2.d.2d) Offside steering rack gaiter deteriorated (2.2.d.2d) 13 May 2014 [13:24] 13/05/2014 629633434125 629633434125

ALL 426 NKT Failure Faults [6]

ALL Failure faults, ORDERED by OCCURRENCE DURING 426 NKT's MOT HISTORY
ALL 426 NKT Failure Faults [6]
ALL Failure faults, ORDERED by OCCURRENCE DURING 426 NKT's MOT HISTORY
Fail Faults | source www.vehiclestats.co.uk
Fault Fault Test Date Test Date/Time Reference MOT Test Reference
1 Nearside headlamp not in good working order adversely affecting beam image (1.2.4a) Nearside headlamp not in good working order adversely affecting beam image (1.2.4a) 24 July 2009 [14:53] 24/07/2009 462125309255 462125309255
1 Offside headlamp not in good working order adversely affecting beam image (1.2.4a) Offside headlamp not in good working order adversely affecting beam image (1.2.4a) 24 July 2009 [14:53] 24/07/2009 462125309255 462125309255
1 Nearside rear shock absorber has a serious fluid leak (2.7.3) Nearside rear shock absorber has a serious fluid leak (2.7.3) 24 July 2009 [14:53] 24/07/2009 462125309255 462125309255
1 Parking brake: efficiency below requirements (3.7.b.7) Parking brake: efficiency below requirements (3.7.b.7) 24 July 2009 [14:53] 24/07/2009 462125309255 462125309255
1 Brakes imbalanced across an axle (3.7.b.5b) Brakes imbalanced across an axle (3.7.b.5b) 24 July 2009 [14:53] 24/07/2009 462125309255 462125309255
1 Nearside rear brake recording little or no effort (3.7.b.5a) Nearside rear brake recording little or no effort (3.7.b.5a) 24 July 2009 [14:53] 24/07/2009 462125309255 462125309255

ALL 426 NKT User Entered Faults [2]

ALL User Entered faults, ORDERED by OCCURRENCE DURING 426 NKT's MOT HISTORY
ALL 426 NKT User Entered Faults [2]
ALL User Entered faults, ORDERED by OCCURRENCE DURING 426 NKT's MOT HISTORY
User Entered Faults | source www.vehiclestats.co.uk
Fault Fault Test Date Test Date/Time Reference MOT Test Reference
1 Slight roughness in o/s/f wheel bearing Slight roughness in o/s/f wheel bearing 01 October 2010 [07:44] 01/10/2010 243284770250 243284770250
1 Corrosion to n/s/f brake pipe Corrosion to n/s/f brake pipe 24 July 2009 [14:53] 24/07/2009 462125309255 462125309255

MOT TEST: 16 September 2017 09:55:50 PASSED
MOT TEST: 16 September 2017 09:55:50 PASSED

This test (645116064250) was completed on the 16 September 2017 09:55:50 and PASSED the requirements for a valid MOT with 0 comments.

This test (645116064250) was completed on the 16 September 2017 09:55:50 and PASSED the requirements for a valid MOT with 0 comments.

Recorded mileage: 11,064

Recorded mileage: 11,064


MOT TEST: 16 August 2016 09:29:10 PASSED
MOT TEST: 16 August 2016 09:29:10 PASSED

This test (571567279623) was completed on the 16 August 2016 09:29:10 and PASSED the requirements for a valid MOT with 0 comments.

This test (571567279623) was completed on the 16 August 2016 09:29:10 and PASSED the requirements for a valid MOT with 0 comments.

Recorded mileage: 10,674

Recorded mileage: 10,674


MOT TEST: 20 January 2015 10:59:34 PASSED
MOT TEST: 20 January 2015 10:59:34 PASSED

This test (958760725016) was completed on the 20 January 2015 10:59:34 and PASSED the requirements for a valid MOT with 0 comments.

This test (958760725016) was completed on the 20 January 2015 10:59:34 and PASSED the requirements for a valid MOT with 0 comments.

Recorded mileage: 9,687

Recorded mileage: 9,687


MOT TEST: 13 May 2014 13:24:40 PASSED
MOT TEST: 13 May 2014 13:24:40 PASSED

This test (629633434125) was completed on the 13 May 2014 13:24:40 and PASSED the requirements for a valid MOT with 1 comments.

This test (629633434125) was completed on the 13 May 2014 13:24:40 and PASSED the requirements for a valid MOT with 1 comments.

Recorded mileage: 9,449

Recorded mileage: 9,449


ADVISORY


MOT TEST: 17 March 2011 14:26:26 PASSED
MOT TEST: 17 March 2011 14:26:26 PASSED

This test (249856571054) was completed on the 17 March 2011 14:26:26 and PASSED the requirements for a valid MOT with 0 comments.

This test (249856571054) was completed on the 17 March 2011 14:26:26 and PASSED the requirements for a valid MOT with 0 comments.

Recorded mileage: 4,657

Recorded mileage: 4,657


MOT TEST: 01 October 2010 07:44:13 PASSED
MOT TEST: 01 October 2010 07:44:13 PASSED

This test (243284770250) was completed on the 01 October 2010 07:44:13 and PASSED the requirements for a valid MOT with 1 comments.

This test (243284770250) was completed on the 01 October 2010 07:44:13 and PASSED the requirements for a valid MOT with 1 comments.

Recorded mileage: 4,424

Recorded mileage: 4,424


USER ENTERED


MOT TEST: 30 July 2009 14:09:13 PASSED
MOT TEST: 30 July 2009 14:09:13 PASSED

This test (110251019280) was completed on the 30 July 2009 14:09:13 and PASSED the requirements for a valid MOT with 0 comments.

This test (110251019280) was completed on the 30 July 2009 14:09:13 and PASSED the requirements for a valid MOT with 0 comments.

Recorded mileage: 4,140

Recorded mileage: 4,140


MOT TEST: 24 July 2009 14:53:29 FAILED
MOT TEST: 24 July 2009 14:53:29 FAILED

This test (462125309255) was completed on the 24 July 2009 14:53:29 and FAILED the requirements for a valid MOT with 7 comments.

This test (462125309255) was completed on the 24 July 2009 14:53:29 and FAILED the requirements for a valid MOT with 7 comments.

Recorded mileage: 4,129

Recorded mileage: 4,129


FAIL

USER ENTERED