427 1VU


4271VU is registered to a Cream 1964, Morris with a Petrol engine. It Failed its most recent MOT Test on the 21 March 2018

2 unique faults (2 Total) reported in its MOT History (4 Tests).

0 common/recurring faults.

75% (3) MOT Pass Rate and a 25% (1) MOT Failure Rate.

73,081 recorded miles.

427 1VU


4271VU is registered to a Cream 1964, Morris with a Petrol engine. It Failed its most recent MOT Test on the 21 March 2018

2 unique faults (2 Total) reported in its MOT History (4 Tests).

0 common/recurring faults.

75% (3) MOT Pass Rate and a 25% (1) MOT Failure Rate.

73,081 recorded miles.

MOT PASS/Failure rate for 427 1VU

all MOT test results for 427 1VU represented as a percentage
MOT PASS/Failure rate for 427 1VU
all MOT test results for 427 1VU represented as a percentage

PERCENTAGE OF VEHICLE FAULTS WITH 427 1VU

ALL REPORTED FAULTS, DISPLAYED BY PERCENTAGE OF OCCURRENCE DURING ALL MOT TESTS
PERCENTAGE OF VEHICLE FAULTS WITH 427 1VU
ALL REPORTED FAULTS, DISPLAYED BY PERCENTAGE OF OCCURRENCE DURING ALL MOT TESTS
FAIL

427 1VU annual Faults by type

ALL REPORTED FAULTS, DISPLAYED over time and categorised by type
427 1VU annual Faults by type
ALL REPORTED FAULTS, DISPLAYED over time and categorised by type

ALL 427 1VU Failure Faults [2]

ALL Failure faults, ORDERED by OCCURRENCE DURING 427 1VU's MOT HISTORY
ALL 427 1VU Failure Faults [2]
ALL Failure faults, ORDERED by OCCURRENCE DURING 427 1VU's MOT HISTORY
Fail Faults | source www.vehiclestats.co.uk
Fault Fault Test Date Test Date/Time Reference MOT Test Reference
1 Service brake: efficiency below requirements (3.7.b.7) Service brake: efficiency below requirements (3.7.b.7) 15 March 2018 [09:44] 15/03/2018 897145770040 897145770040
1 Parking brake: efficiency below requirements (3.7.b.7) Parking brake: efficiency below requirements (3.7.b.7) 15 March 2018 [09:44] 15/03/2018 897145770040 897145770040

MOT TEST: 21 March 2018 14:43:28 PASSED
MOT TEST: 21 March 2018 14:43:28 PASSED

This test (420100416620) was completed on the 21 March 2018 14:43:28 and PASSED the requirements for a valid MOT with 0 comments.

This test (420100416620) was completed on the 21 March 2018 14:43:28 and PASSED the requirements for a valid MOT with 0 comments.

Recorded mileage: 73,081

Recorded mileage: 73,081


MOT TEST: 15 March 2018 09:44:20 FAILED
MOT TEST: 15 March 2018 09:44:20 FAILED

This test (897145770040) was completed on the 15 March 2018 09:44:20 and FAILED the requirements for a valid MOT with 2 comments.

This test (897145770040) was completed on the 15 March 2018 09:44:20 and FAILED the requirements for a valid MOT with 2 comments.

Recorded mileage: 73,076

Recorded mileage: 73,076


FAIL


MOT TEST: 08 April 2013 10:03:03 PASSED
MOT TEST: 08 April 2013 10:03:03 PASSED

This test (207548493059) was completed on the 08 April 2013 10:03:03 and PASSED the requirements for a valid MOT with 0 comments.

This test (207548493059) was completed on the 08 April 2013 10:03:03 and PASSED the requirements for a valid MOT with 0 comments.

Recorded mileage: 73,057

Recorded mileage: 73,057


MOT TEST: 27 May 2011 14:05:03 PASSED
MOT TEST: 27 May 2011 14:05:03 PASSED

This test (766687841160) was completed on the 27 May 2011 14:05:03 and PASSED the requirements for a valid MOT with 0 comments.

This test (766687841160) was completed on the 27 May 2011 14:05:03 and PASSED the requirements for a valid MOT with 0 comments.

Recorded mileage: 72,991

Recorded mileage: 72,991