437 UPH


437UPH is registered to a White 1961, Morris Minor with a Petrol engine. It Failed its most recent MOT Test on the 19 April 2017

30 unique faults (36 Total) reported in its MOT History (14 Tests).

6 common/recurring faults, the most frequent (2 times) is: front top trunion rubbers worn.

57% (8) MOT Pass Rate and a 43% (6) MOT Failure Rate.

48,901 recorded miles.

437 UPH


437UPH is registered to a White 1961, Morris Minor with a Petrol engine. It Failed its most recent MOT Test on the 19 April 2017

30 unique faults (36 Total) reported in its MOT History (14 Tests).

6 common/recurring faults, the most frequent (2 times) is: front top trunion rubbers worn.

57% (8) MOT Pass Rate and a 43% (6) MOT Failure Rate.

48,901 recorded miles.

MOT PASS/Failure rate for 437 UPH

all MOT test results for 437 UPH represented as a percentage
MOT PASS/Failure rate for 437 UPH
all MOT test results for 437 UPH represented as a percentage

PERCENTAGE OF VEHICLE FAULTS WITH 437 UPH

ALL REPORTED FAULTS, DISPLAYED BY PERCENTAGE OF OCCURRENCE DURING ALL MOT TESTS
PERCENTAGE OF VEHICLE FAULTS WITH 437 UPH
ALL REPORTED FAULTS, DISPLAYED BY PERCENTAGE OF OCCURRENCE DURING ALL MOT TESTS
ADVISORY

FAIL

USER ENTERED

437 UPH annual Faults by type

ALL REPORTED FAULTS, DISPLAYED over time and categorised by type
437 UPH annual Faults by type
ALL REPORTED FAULTS, DISPLAYED over time and categorised by type

RECURRING FAULTS WITH 437 UPH

FAULTS THAT HAVE OCCURED MORE THAN ONCE DURING 437 UPH's MOT HISTORY
RECURRING FAULTS WITH 437 UPH
FAULTS THAT HAVE OCCURED MORE THAN ONCE DURING 437 UPH's MOT HISTORY
Fault Fault Test Date Test Date/Time Reference MOT Test Reference
2 Front top trunion rubbers worn Front top trunion rubbers worn 19 April 2017 [11:34] 19/04/2017 08 April 2017 [09:06] 08/04/2017 632647298544 632647298544 472813757370 472813757370
2 Water pump dropping off & leaking Water pump dropping off & leaking 19 April 2017 [11:34] 19/04/2017 08 April 2017 [09:06] 08/04/2017 632647298544 632647298544 472813757370 472813757370
2 Offside front brake hose slightly deteriorated (3.6.b.4d) Offside front brake hose slightly deteriorated (3.6.b.4d) 31 July 2015 [13:14] 31/07/2015 31 July 2015 [08:41] 31/07/2015 701250536430 701250536430 726812134145 726812134145
2 Offside front brake pipe slightly corroded (3.6.b.2c) Offside front brake pipe slightly corroded (3.6.b.2c) 31 July 2015 [13:14] 31/07/2015 31 July 2015 [08:41] 31/07/2015 701250536430 701250536430 726812134145 726812134145
2 Nearside engine mounting deteriorated, but not resulting in excessive movement (6.1.d.1a) Nearside engine mounting deteriorated, but not resulting in excessive movement (6.1.d.1a) 31 July 2015 [13:14] 31/07/2015 31 July 2015 [08:41] 31/07/2015 701250536430 701250536430 726812134145 726812134145
2 Parking brake lever has little reserve travel (3.1.6b) Parking brake lever has little reserve travel (3.1.6b) 31 July 2015 [13:14] 31/07/2015 31 July 2015 [08:41] 31/07/2015 701250536430 701250536430 726812134145 726812134145

ALL 437 UPH ADVISORIES [13]

ALL ADVISORIES, ORDERED by OCCURRENCE DURING 437 UPH's MOT HISTORY
ALL 437 UPH ADVISORIES [13]
ALL ADVISORIES, ORDERED by OCCURRENCE DURING 437 UPH's MOT HISTORY
Advisory Faults | source www.vehiclestats.co.uk
Fault Fault Test Date Test Date/Time Reference MOT Test Reference
2 Front top trunion rubbers worn Front top trunion rubbers worn 19 April 2017 [11:34] 19/04/2017 08 April 2017 [09:06] 08/04/2017 632647298544 632647298544 472813757370 472813757370
2 Water pump dropping off & leaking Water pump dropping off & leaking 19 April 2017 [11:34] 19/04/2017 08 April 2017 [09:06] 08/04/2017 632647298544 632647298544 472813757370 472813757370
2 Offside front brake hose slightly deteriorated (3.6.b.4d) Offside front brake hose slightly deteriorated (3.6.b.4d) 31 July 2015 [13:14] 31/07/2015 31 July 2015 [08:41] 31/07/2015 701250536430 701250536430 726812134145 726812134145
2 Offside front brake pipe slightly corroded (3.6.b.2c) Offside front brake pipe slightly corroded (3.6.b.2c) 31 July 2015 [13:14] 31/07/2015 31 July 2015 [08:41] 31/07/2015 701250536430 701250536430 726812134145 726812134145
2 Nearside engine mounting deteriorated, but not resulting in excessive movement (6.1.d.1a) Nearside engine mounting deteriorated, but not resulting in excessive movement (6.1.d.1a) 31 July 2015 [13:14] 31/07/2015 31 July 2015 [08:41] 31/07/2015 701250536430 701250536430 726812134145 726812134145
2 Parking brake lever has little reserve travel (3.1.6b) Parking brake lever has little reserve travel (3.1.6b) 31 July 2015 [13:14] 31/07/2015 31 July 2015 [08:41] 31/07/2015 701250536430 701250536430 726812134145 726812134145
1 Front wheel bearing has slight play (2.5.a.3c) Front wheel bearing has slight play (2.5.a.3c) 30 March 2012 [11:06] 30/03/2012 987050692068 987050692068

ALL 437 UPH Failure Faults [22]

ALL Failure faults, ORDERED by OCCURRENCE DURING 437 UPH's MOT HISTORY
ALL 437 UPH Failure Faults [22]
ALL Failure faults, ORDERED by OCCURRENCE DURING 437 UPH's MOT HISTORY
Fail Faults | source www.vehiclestats.co.uk
Fault Fault Test Date Test Date/Time Reference MOT Test Reference
1 Fuel pipe leaking (7.2.3) Fuel pipe leaking (7.2.3) 08 April 2017 [09:06] 08/04/2017 472813757370 472813757370
1 Nearside front front brake binding (3.7.b.1) Nearside front front brake binding (3.7.b.1) 08 April 2017 [09:06] 08/04/2017 472813757370 472813757370
1 Offside windscreen wiper does not clear the windscreen effectively (8.2.2) Offside windscreen wiper does not clear the windscreen effectively (8.2.2) 31 July 2015 [08:41] 31/07/2015 726812134145 726812134145
1 Nearside front position lamp(s) not working (1.1.a.3b) Nearside front position lamp(s) not working (1.1.a.3b) 31 July 2015 [08:41] 31/07/2015 726812134145 726812134145
1 Nearside registration plate lamp not working (1.1.c.1d) Nearside registration plate lamp not working (1.1.c.1d) 31 July 2015 [08:41] 31/07/2015 726812134145 726812134145
1 Nearside front steering rack gaiter split (2.2.d.2d) Nearside front steering rack gaiter split (2.2.d.2d) 22 April 2014 [11:52] 22/04/2014 295492514160 295492514160
1 Offside front track rod end ball joint dust cover excessively damaged so that it no longer prevents the ingress of dirt (2.2.c.1c) Offside front track rod end ball joint dust cover excessively damaged so that it no longer prevents the ingress of dirt (2.2.c.1c) 22 April 2014 [11:52] 22/04/2014 295492514160 295492514160
1 Offside front electrical wiring inadequately supported (1.9.2a) Offside front electrical wiring inadequately supported (1.9.2a) 08 April 2013 [13:58] 08/04/2013 158248093415 158248093415
1 Offside rear rear brake binding (3.7.b.1) Offside rear rear brake binding (3.7.b.1) 08 April 2013 [13:58] 08/04/2013 158248093415 158248093415
1 Nearside rear rear brake recording little or no effort (3.7.b.5a) Nearside rear rear brake recording little or no effort (3.7.b.5a) 08 April 2013 [13:58] 08/04/2013 158248093415 158248093415
1 Windscreen washer provides insufficient washer liquid (8.2.3) Windscreen washer provides insufficient washer liquid (8.2.3) 08 April 2013 [13:58] 08/04/2013 158248093415 158248093415
1 Nearside front front passenger door does not latch securely closed (6.2.b.1a) Nearside front front passenger door does not latch securely closed (6.2.b.1a) 08 April 2013 [13:58] 08/04/2013 158248093415 158248093415
1 Registration plate lamp not working (1.1.5c) Registration plate lamp not working (1.1.5c) 31 March 2009 [11:30] 31/03/2009 720080899043 720080899043
1 Rear brake application uneven (3.7.b.2) Rear brake application uneven (3.7.b.2) 31 March 2009 [11:30] 31/03/2009 720080899043 720080899043
1 Rear brakes release unevenly (3.7.b.4) Rear brakes release unevenly (3.7.b.4) 31 March 2009 [11:30] 31/03/2009 720080899043 720080899043
1 Nearside steering locking device missing (2.2.c.1g) Nearside steering locking device missing (2.2.c.1g) 31 March 2009 [11:30] 31/03/2009 720080899043 720080899043
1 Nearside front headlamp not working on dipped beam (1.7.5a) Nearside front headlamp not working on dipped beam (1.7.5a) 10 June 2006 [15:39] 10/06/2006 403441366162 403441366162
1 Offside front front position lamp(s) not working (1.1.a.3b) Offside front front position lamp(s) not working (1.1.a.3b) 10 June 2006 [15:39] 10/06/2006 403441366162 403441366162
1 Nearside front rear brake application uneven (3.7.b.2) Nearside front rear brake application uneven (3.7.b.2) 10 June 2006 [15:39] 10/06/2006 403441366162 403441366162
1 Service brake: efficiency below requirements (3.7.b.7) Service brake: efficiency below requirements (3.7.b.7) 10 June 2006 [15:39] 10/06/2006 403441366162 403441366162
1 Parking brake: efficiency below requirements (3.7.b.7) Parking brake: efficiency below requirements (3.7.b.7) 10 June 2006 [15:39] 10/06/2006 403441366162 403441366162
1 Brakes imbalanced across an axle (3.7.b.5b) Brakes imbalanced across an axle (3.7.b.5b) 10 June 2006 [15:39] 10/06/2006 403441366162 403441366162

ALL 437 UPH User Entered Faults [1]

ALL User Entered faults, ORDERED by OCCURRENCE DURING 437 UPH's MOT HISTORY
ALL 437 UPH User Entered Faults [1]
ALL User Entered faults, ORDERED by OCCURRENCE DURING 437 UPH's MOT HISTORY
Advisory Faults | source www.vehiclestats.co.uk
Fault Fault Test Date Test Date/Time Reference MOT Test Reference
1 Slight play in o/s front upper suspension joint. Slight play in o/s front upper suspension joint. 30 March 2012 [11:06] 30/03/2012 987050692068 987050692068

MOT TEST: 19 April 2017 11:34:15 PASSED
MOT TEST: 19 April 2017 11:34:15 PASSED

This test (632647298544) was completed on the 19 April 2017 11:34:15 and PASSED the requirements for a valid MOT with 2 comments.

This test (632647298544) was completed on the 19 April 2017 11:34:15 and PASSED the requirements for a valid MOT with 2 comments.

Recorded mileage: 8,701

Recorded mileage: 8,701


ADVISORY


MOT TEST: 08 April 2017 09:06:32 FAILED
MOT TEST: 08 April 2017 09:06:32 FAILED

This test (472813757370) was completed on the 08 April 2017 09:06:32 and FAILED the requirements for a valid MOT with 4 comments.

This test (472813757370) was completed on the 08 April 2017 09:06:32 and FAILED the requirements for a valid MOT with 4 comments.

Recorded mileage: 8,687

Recorded mileage: 8,687


ADVISORY

FAIL


MOT TEST: 31 July 2015 13:14:50 PASSED
MOT TEST: 31 July 2015 13:14:50 PASSED

This test (701250536430) was completed on the 31 July 2015 13:14:50 and PASSED the requirements for a valid MOT with 4 comments.

This test (701250536430) was completed on the 31 July 2015 13:14:50 and PASSED the requirements for a valid MOT with 4 comments.

Recorded mileage: 8,393

Recorded mileage: 8,393


ADVISORY


MOT TEST: 31 July 2015 08:41:19 FAILED
MOT TEST: 31 July 2015 08:41:19 FAILED

This test (726812134145) was completed on the 31 July 2015 08:41:19 and FAILED the requirements for a valid MOT with 7 comments.

This test (726812134145) was completed on the 31 July 2015 08:41:19 and FAILED the requirements for a valid MOT with 7 comments.

Recorded mileage: 8,393

Recorded mileage: 8,393


ADVISORY

FAIL


MOT TEST: 25 April 2014 08:55:21 PASSED
MOT TEST: 25 April 2014 08:55:21 PASSED

This test (635905114189) was completed on the 25 April 2014 08:55:21 and PASSED the requirements for a valid MOT with 0 comments.

This test (635905114189) was completed on the 25 April 2014 08:55:21 and PASSED the requirements for a valid MOT with 0 comments.

Recorded mileage: 7,339

Recorded mileage: 7,339


MOT TEST: 22 April 2014 11:52:50 FAILED
MOT TEST: 22 April 2014 11:52:50 FAILED

This test (295492514160) was completed on the 22 April 2014 11:52:50 and FAILED the requirements for a valid MOT with 2 comments.

This test (295492514160) was completed on the 22 April 2014 11:52:50 and FAILED the requirements for a valid MOT with 2 comments.

Recorded mileage: 7,339

Recorded mileage: 7,339


FAIL


MOT TEST: 12 April 2013 10:39:34 PASSED
MOT TEST: 12 April 2013 10:39:34 PASSED

This test (369822203180) was completed on the 12 April 2013 10:39:34 and PASSED the requirements for a valid MOT with 0 comments.

This test (369822203180) was completed on the 12 April 2013 10:39:34 and PASSED the requirements for a valid MOT with 0 comments.

Recorded mileage: 7,016

Recorded mileage: 7,016


MOT TEST: 08 April 2013 13:58:45 FAILED
MOT TEST: 08 April 2013 13:58:45 FAILED

This test (158248093415) was completed on the 08 April 2013 13:58:45 and FAILED the requirements for a valid MOT with 5 comments.

This test (158248093415) was completed on the 08 April 2013 13:58:45 and FAILED the requirements for a valid MOT with 5 comments.

Recorded mileage: 7,015

Recorded mileage: 7,015


FAIL


MOT TEST: 30 March 2012 11:06:04 PASSED
MOT TEST: 30 March 2012 11:06:04 PASSED

This test (987050692068) was completed on the 30 March 2012 11:06:04 and PASSED the requirements for a valid MOT with 2 comments.

This test (987050692068) was completed on the 30 March 2012 11:06:04 and PASSED the requirements for a valid MOT with 2 comments.

Recorded mileage: 48,901

Recorded mileage: 48,901


ADVISORY

USER ENTERED


MOT TEST: 02 April 2009 11:57:15 PASSED
MOT TEST: 02 April 2009 11:57:15 PASSED

This test (944812699040) was completed on the 02 April 2009 11:57:15 and PASSED the requirements for a valid MOT with 0 comments.

This test (944812699040) was completed on the 02 April 2009 11:57:15 and PASSED the requirements for a valid MOT with 0 comments.

Recorded mileage: 48,901

Recorded mileage: 48,901


MOT TEST: 31 March 2009 11:30:54 FAILED
MOT TEST: 31 March 2009 11:30:54 FAILED

This test (720080899043) was completed on the 31 March 2009 11:30:54 and FAILED the requirements for a valid MOT with 4 comments.

This test (720080899043) was completed on the 31 March 2009 11:30:54 and FAILED the requirements for a valid MOT with 4 comments.

Recorded mileage: 48,901

Recorded mileage: 48,901


FAIL


MOT TEST: 24 July 2007 17:51:24 PASSED
MOT TEST: 24 July 2007 17:51:24 PASSED

This test (681495007237) was completed on the 24 July 2007 17:51:24 and PASSED the requirements for a valid MOT with 0 comments.

This test (681495007237) was completed on the 24 July 2007 17:51:24 and PASSED the requirements for a valid MOT with 0 comments.

Recorded mileage: 48,566

Recorded mileage: 48,566


MOT TEST: 15 June 2006 16:44:31 PASSED
MOT TEST: 15 June 2006 16:44:31 PASSED

This test (852706966131) was completed on the 15 June 2006 16:44:31 and PASSED the requirements for a valid MOT with 0 comments.

This test (852706966131) was completed on the 15 June 2006 16:44:31 and PASSED the requirements for a valid MOT with 0 comments.

Recorded mileage: 46,454

Recorded mileage: 46,454


MOT TEST: 10 June 2006 15:39:45 FAILED
MOT TEST: 10 June 2006 15:39:45 FAILED

This test (403441366162) was completed on the 10 June 2006 15:39:45 and FAILED the requirements for a valid MOT with 6 comments.

This test (403441366162) was completed on the 10 June 2006 15:39:45 and FAILED the requirements for a valid MOT with 6 comments.

Recorded mileage: 46,453

Recorded mileage: 46,453


FAIL