438 UXN


438UXN is registered to a White 1956, Morris Minor with a Petrol engine. It Failed its most recent MOT Test on the 27 June 2011

22 unique faults (23 Total) reported in its MOT History (11 Tests).

1 common/recurring faults.

55% (6) MOT Pass Rate and a 45% (5) MOT Failure Rate.

17,791 recorded miles.

438 UXN


438UXN is registered to a White 1956, Morris Minor with a Petrol engine. It Failed its most recent MOT Test on the 27 June 2011

22 unique faults (23 Total) reported in its MOT History (11 Tests).

1 common/recurring faults.

55% (6) MOT Pass Rate and a 45% (5) MOT Failure Rate.

17,791 recorded miles.

MOT PASS/Failure rate for 438 UXN

all MOT test results for 438 UXN represented as a percentage
MOT PASS/Failure rate for 438 UXN
all MOT test results for 438 UXN represented as a percentage

PERCENTAGE OF VEHICLE FAULTS WITH 438 UXN

ALL REPORTED FAULTS, DISPLAYED BY PERCENTAGE OF OCCURRENCE DURING ALL MOT TESTS
PERCENTAGE OF VEHICLE FAULTS WITH 438 UXN
ALL REPORTED FAULTS, DISPLAYED BY PERCENTAGE OF OCCURRENCE DURING ALL MOT TESTS
FAIL

USER ENTERED

PASS WITH RECTIFICATION

438 UXN annual Faults by type

ALL REPORTED FAULTS, DISPLAYED over time and categorised by type
438 UXN annual Faults by type
ALL REPORTED FAULTS, DISPLAYED over time and categorised by type

ALL 438 UXN Failure Faults [16]

ALL Failure faults, ORDERED by OCCURRENCE DURING 438 UXN's MOT HISTORY
ALL 438 UXN Failure Faults [16]
ALL Failure faults, ORDERED by OCCURRENCE DURING 438 UXN's MOT HISTORY
Fail Faults | source www.vehiclestats.co.uk
Fault Fault Test Date Test Date/Time Reference MOT Test Reference
1 Offside headlamp not working on dipped beam (1.7.5a) Offside headlamp not working on dipped beam (1.7.5a) 22 June 2011 [10:39] 22/06/2011 217763371120 217763371120
1 Offside front brakes release unevenly (3.7.b.4) Offside front brakes release unevenly (3.7.b.4) 22 June 2011 [10:39] 22/06/2011 217763371120 217763371120
1 Fuel cap/sealing device sealing washer missing (7.2.4c) Fuel cap/sealing device sealing washer missing (7.2.4c) 01 July 2010 [12:22] 01/07/2010 884112580157 884112580157
1 Windscreen washer provides insufficient washer liquid (8.2.3) Windscreen washer provides insufficient washer liquid (8.2.3) 21 July 2008 [11:36] 21/07/2008 630693108299 630693108299
1 Nearside headlamp not working on main beam (1.7.5a) Nearside headlamp not working on main beam (1.7.5a) 21 July 2008 [11:36] 21/07/2008 630693108299 630693108299
1 Nearside stop lamp not working (1.2.1b) Nearside stop lamp not working (1.2.1b) 21 July 2008 [11:36] 21/07/2008 630693108299 630693108299
1 Offside stop lamp not working (1.2.1b) Offside stop lamp not working (1.2.1b) 21 July 2008 [11:36] 21/07/2008 630693108299 630693108299
1 Exhaust engine idle speed too high (7.3.a.2a) Exhaust engine idle speed too high (7.3.a.2a) 21 July 2008 [11:36] 21/07/2008 630693108299 630693108299
1 Rear exhaust has a major leak of exhaust gases (7.1.2) Rear exhaust has a major leak of exhaust gases (7.1.2) 21 July 2008 [11:36] 21/07/2008 630693108299 630693108299
1 Upper steering column top bearing excessively worn (2.1.2c) Upper steering column top bearing excessively worn (2.1.2c) 21 July 2008 [11:36] 21/07/2008 630693108299 630693108299
1 Brakes imbalanced across an axle (3.7.b.5b) Brakes imbalanced across an axle (3.7.b.5b) 21 July 2008 [11:36] 21/07/2008 630693108299 630693108299
1 Offside rear tyre has a cut in excess of the requirements deep enough to reach the ply or cords (4.1.d.1a) Offside rear tyre has a cut in excess of the requirements deep enough to reach the ply or cords (4.1.d.1a) 21 July 2008 [11:36] 21/07/2008 630693108299 630693108299
1 Horn not working (1.6.2a) Horn not working (1.6.2a) 29 May 2007 [16:15] 29/05/2007 393839647103 393839647103
1 Steering rack insecure (2.2.b.1a) Steering rack insecure (2.2.b.1a) 29 May 2007 [16:15] 29/05/2007 393839647103 393839647103
1 Service brake: efficiency below requirements (3.7.b.7) Service brake: efficiency below requirements (3.7.b.7) 29 May 2007 [16:15] 29/05/2007 393839647103 393839647103
1 Parking brake: efficiency below requirements (3.7.b.7) Parking brake: efficiency below requirements (3.7.b.7) 29 May 2007 [16:15] 29/05/2007 393839647103 393839647103

ALL 438 UXN User Entered Faults [2]

ALL User Entered faults, ORDERED by OCCURRENCE DURING 438 UXN's MOT HISTORY
ALL 438 UXN User Entered Faults [2]
ALL User Entered faults, ORDERED by OCCURRENCE DURING 438 UXN's MOT HISTORY
Fail Faults | source www.vehiclestats.co.uk
Fault Fault Test Date Test Date/Time Reference MOT Test Reference
1 Front tyres 145 x 14, rear tyres 155 x 14 Front tyres 145 x 14, rear tyres 155 x 14 21 July 2008 [11:36] 21/07/2008 630693108299 630693108299
1 Nearside rear brake effort slightly low (backplate damp) Nearside rear brake effort slightly low (backplate damp) 21 July 2008 [11:36] 21/07/2008 630693108299 630693108299

ALL 438 UXN Pass With Rectification Faults [5]

ALL Pass With Rectification faults, ORDERED by OCCURRENCE DURING 438 UXN's MOT HISTORY
ALL 438 UXN Pass With Rectification Faults [5]
ALL Pass With Rectification faults, ORDERED by OCCURRENCE DURING 438 UXN's MOT HISTORY
Pass With Rectification Faults | source www.vehiclestats.co.uk
Fault Fault Test Date Test Date/Time Reference MOT Test Reference
1 Registration plate lamp not working (1.1.5c) Registration plate lamp not working (1.1.5c) 24 July 2009 [17:58] 24/07/2009 183675809298 183675809298
1 Windscreen washer provides insufficient washer liquid (8.2.3) Windscreen washer provides insufficient washer liquid (8.2.3) 24 July 2009 [17:58] 24/07/2009 183675809298 183675809298
1 Nearside front tie bar/rod rubber mounting deteriorated resulting in excessive movement (2.4.g.2) Nearside front tie bar/rod rubber mounting deteriorated resulting in excessive movement (2.4.g.2) 24 July 2009 [17:58] 24/07/2009 183675809298 183675809298
1 Offside front tie bar/rod rubber mounting deteriorated resulting in excessive movement (2.4.g.2) Offside front tie bar/rod rubber mounting deteriorated resulting in excessive movement (2.4.g.2) 24 July 2009 [17:58] 24/07/2009 183675809298 183675809298
1 Nearside rear brake recording little or no effort (3.7.b.5a) Nearside rear brake recording little or no effort (3.7.b.5a) 24 July 2009 [17:58] 24/07/2009 183675809298 183675809298

MOT TEST: 27 June 2011 09:02:59 PASSED
MOT TEST: 27 June 2011 09:02:59 PASSED

This test (539758471199) was completed on the 27 June 2011 09:02:59 and PASSED the requirements for a valid MOT with 0 comments.

This test (539758471199) was completed on the 27 June 2011 09:02:59 and PASSED the requirements for a valid MOT with 0 comments.

Recorded mileage: 17,791

Recorded mileage: 17,791


MOT TEST: 22 June 2011 10:39:42 FAILED
MOT TEST: 22 June 2011 10:39:42 FAILED

This test (217763371120) was completed on the 22 June 2011 10:39:42 and FAILED the requirements for a valid MOT with 2 comments.

This test (217763371120) was completed on the 22 June 2011 10:39:42 and FAILED the requirements for a valid MOT with 2 comments.

Recorded mileage: 17,791

Recorded mileage: 17,791


FAIL


MOT TEST: 02 July 2010 15:54:19 PASSED
MOT TEST: 02 July 2010 15:54:19 PASSED

This test (254223680154) was completed on the 02 July 2010 15:54:19 and PASSED the requirements for a valid MOT with 0 comments.

This test (254223680154) was completed on the 02 July 2010 15:54:19 and PASSED the requirements for a valid MOT with 0 comments.

Recorded mileage: 11,773

Recorded mileage: 11,773


MOT TEST: 01 July 2010 12:22:33 FAILED
MOT TEST: 01 July 2010 12:22:33 FAILED

This test (884112580157) was completed on the 01 July 2010 12:22:33 and FAILED the requirements for a valid MOT with 1 comments.

This test (884112580157) was completed on the 01 July 2010 12:22:33 and FAILED the requirements for a valid MOT with 1 comments.

Recorded mileage: 11,773

Recorded mileage: 11,773


FAIL


MOT TEST: 24 July 2009 17:58:26 PASSED
MOT TEST: 24 July 2009 17:58:26 PASSED

This test (240625509249) was completed on the 24 July 2009 17:58:26 and PASSED the requirements for a valid MOT with 0 comments.

This test (240625509249) was completed on the 24 July 2009 17:58:26 and PASSED the requirements for a valid MOT with 0 comments.

Recorded mileage: 17,731

Recorded mileage: 17,731


MOT TEST: 24 July 2009 17:58:26 FAILED
MOT TEST: 24 July 2009 17:58:26 FAILED

This test (183675809298) was completed on the 24 July 2009 17:58:26 and FAILED the requirements for a valid MOT with 5 comments.

This test (183675809298) was completed on the 24 July 2009 17:58:26 and FAILED the requirements for a valid MOT with 5 comments.

Recorded mileage: 17,731

Recorded mileage: 17,731


PASS WITH RECTIFICATION


MOT TEST: 31 July 2008 15:33:00 PASSED
MOT TEST: 31 July 2008 15:33:00 PASSED

This test (820153418268) was completed on the 31 July 2008 15:33:00 and PASSED the requirements for a valid MOT with 0 comments.

This test (820153418268) was completed on the 31 July 2008 15:33:00 and PASSED the requirements for a valid MOT with 0 comments.

Recorded mileage: 17,258

Recorded mileage: 17,258


MOT TEST: 21 July 2008 11:36:50 FAILED
MOT TEST: 21 July 2008 11:36:50 FAILED

This test (630693108299) was completed on the 21 July 2008 11:36:50 and FAILED the requirements for a valid MOT with 11 comments.

This test (630693108299) was completed on the 21 July 2008 11:36:50 and FAILED the requirements for a valid MOT with 11 comments.

Recorded mileage: 17,258

Recorded mileage: 17,258


FAIL

USER ENTERED


MOT TEST: 15 June 2007 14:58:11 PASSED
MOT TEST: 15 June 2007 14:58:11 PASSED

This test (482146067114) was completed on the 15 June 2007 14:58:11 and PASSED the requirements for a valid MOT with 0 comments.

This test (482146067114) was completed on the 15 June 2007 14:58:11 and PASSED the requirements for a valid MOT with 0 comments.

Recorded mileage: 17,101

Recorded mileage: 17,101


MOT TEST: 29 May 2007 16:15:59 FAILED
MOT TEST: 29 May 2007 16:15:59 FAILED

This test (393839647103) was completed on the 29 May 2007 16:15:59 and FAILED the requirements for a valid MOT with 4 comments.

This test (393839647103) was completed on the 29 May 2007 16:15:59 and FAILED the requirements for a valid MOT with 4 comments.

Recorded mileage: 17,101

Recorded mileage: 17,101


FAIL


MOT TEST: 01 June 2006 10:32:01 PASSED
MOT TEST: 01 June 2006 10:32:01 PASSED

This test (431232656187) was completed on the 01 June 2006 10:32:01 and PASSED the requirements for a valid MOT with 0 comments.

This test (431232656187) was completed on the 01 June 2006 10:32:01 and PASSED the requirements for a valid MOT with 0 comments.

Recorded mileage: 16,154

Recorded mileage: 16,154