438 VVK


438VVK is registered to a Grey 1963, Morris Minor 1000 with a Petrol engine. It Failed its most recent MOT Test on the 18 May 2017

11 unique faults (13 Total) reported in its MOT History (3 Tests).

2 common/recurring faults, the most frequent (2 times) is: Nearside Front Suspension component mounting prescribed area is corroded but not considered excessive inner wing (2.4.A.3).

67% (2) MOT Pass Rate and a 33% (1) MOT Failure Rate.

1,076 recorded miles.

438 VVK


438VVK is registered to a Grey 1963, Morris Minor 1000 with a Petrol engine. It Failed its most recent MOT Test on the 18 May 2017

11 unique faults (13 Total) reported in its MOT History (3 Tests).

2 common/recurring faults, the most frequent (2 times) is: Nearside Front Suspension component mounting prescribed area is corroded but not considered excessive inner wing (2.4.A.3).

67% (2) MOT Pass Rate and a 33% (1) MOT Failure Rate.

1,076 recorded miles.

MOT PASS/Failure rate for 438 VVK

all MOT test results for 438 VVK represented as a percentage
MOT PASS/Failure rate for 438 VVK
all MOT test results for 438 VVK represented as a percentage

PERCENTAGE OF VEHICLE FAULTS WITH 438 VVK

ALL REPORTED FAULTS, DISPLAYED BY PERCENTAGE OF OCCURRENCE DURING ALL MOT TESTS
PERCENTAGE OF VEHICLE FAULTS WITH 438 VVK
ALL REPORTED FAULTS, DISPLAYED BY PERCENTAGE OF OCCURRENCE DURING ALL MOT TESTS
ADVISORY

FAIL

USER ENTERED

438 VVK annual Faults by type

ALL REPORTED FAULTS, DISPLAYED over time and categorised by type
438 VVK annual Faults by type
ALL REPORTED FAULTS, DISPLAYED over time and categorised by type

RECURRING FAULTS WITH 438 VVK

FAULTS THAT HAVE OCCURED MORE THAN ONCE DURING 438 VVK's MOT HISTORY
RECURRING FAULTS WITH 438 VVK
FAULTS THAT HAVE OCCURED MORE THAN ONCE DURING 438 VVK's MOT HISTORY
Fault Fault Test Date Test Date/Time Reference MOT Test Reference
2 Nearside front suspension component mounting prescribed area is corroded but not considered excessive inner wing (2.4.a.3) Nearside front suspension component mounting prescribed area is corroded but not considered excessive inner wing (2.4.a.3) 18 May 2017 [13:34] 18/05/2017 09 May 2017 [11:00] 09/05/2017 730720607006 730720607006 347319832240 347319832240
2 Underside of vehicle coated with underseal Underside of vehicle coated with underseal 18 May 2017 [13:34] 18/05/2017 09 May 2017 [11:00] 09/05/2017 730720607006 730720607006 347319832240 347319832240

ALL 438 VVK ADVISORIES [4]

ALL ADVISORIES, ORDERED by OCCURRENCE DURING 438 VVK's MOT HISTORY
ALL 438 VVK ADVISORIES [4]
ALL ADVISORIES, ORDERED by OCCURRENCE DURING 438 VVK's MOT HISTORY
Advisory Faults | source www.vehiclestats.co.uk
Fault Fault Test Date Test Date/Time Reference MOT Test Reference
2 Nearside front suspension component mounting prescribed area is corroded but not considered excessive inner wing (2.4.a.3) Nearside front suspension component mounting prescribed area is corroded but not considered excessive inner wing (2.4.a.3) 18 May 2017 [13:34] 18/05/2017 09 May 2017 [11:00] 09/05/2017 730720607006 730720607006 347319832240 347319832240
2 Underside of vehicle coated with underseal Underside of vehicle coated with underseal 18 May 2017 [13:34] 18/05/2017 09 May 2017 [11:00] 09/05/2017 730720607006 730720607006 347319832240 347319832240

ALL 438 VVK Failure Faults [8]

ALL Failure faults, ORDERED by OCCURRENCE DURING 438 VVK's MOT HISTORY
ALL 438 VVK Failure Faults [8]
ALL Failure faults, ORDERED by OCCURRENCE DURING 438 VVK's MOT HISTORY
Fail Faults | source www.vehiclestats.co.uk
Fault Fault Test Date Test Date/Time Reference MOT Test Reference
1 Nearside front suspension component mounting prescribed area is excessively corroded inner wheel arch (2.4.a.3) Nearside front suspension component mounting prescribed area is excessively corroded inner wheel arch (2.4.a.3) 09 May 2017 [11:00] 09/05/2017 347319832240 347319832240
1 Offside front suspension component mounting prescribed area is excessively corroded inner wheel arch (2.4.a.3) Offside front suspension component mounting prescribed area is excessively corroded inner wheel arch (2.4.a.3) 09 May 2017 [11:00] 09/05/2017 347319832240 347319832240
1 Offside rear brake recording little or no effort (3.7.b.5a) Offside rear brake recording little or no effort (3.7.b.5a) 09 May 2017 [11:00] 09/05/2017 347319832240 347319832240
1 Offside rear parking brake recording little or no effort (3.7.b.6a) Offside rear parking brake recording little or no effort (3.7.b.6a) 09 May 2017 [11:00] 09/05/2017 347319832240 347319832240
1 Brake pedal anti-slip provision missing (3.3.a.1b) Brake pedal anti-slip provision missing (3.3.a.1b) 09 May 2017 [11:00] 09/05/2017 347319832240 347319832240
1 Service brake: efficiency below requirements (3.7.b.7) Service brake: efficiency below requirements (3.7.b.7) 09 May 2017 [11:00] 09/05/2017 347319832240 347319832240
1 Parking brake: efficiency below requirements (3.7.b.7) Parking brake: efficiency below requirements (3.7.b.7) 09 May 2017 [11:00] 09/05/2017 347319832240 347319832240
1 Rear brakes imbalanced across an axle axle 2 (3.7.b.5b) Rear brakes imbalanced across an axle axle 2 (3.7.b.5b) 09 May 2017 [11:00] 09/05/2017 347319832240 347319832240

ALL 438 VVK User Entered Faults [1]

ALL User Entered faults, ORDERED by OCCURRENCE DURING 438 VVK's MOT HISTORY
ALL 438 VVK User Entered Faults [1]
ALL User Entered faults, ORDERED by OCCURRENCE DURING 438 VVK's MOT HISTORY
User Entered Faults | source www.vehiclestats.co.uk
Fault Fault Test Date Test Date/Time Reference MOT Test Reference
1 Car is coverd in underseal Car is coverd in underseal 16 March 2013 [12:16] 16/03/2013 386975773029 386975773029

MOT TEST: 18 May 2017 13:34:24 PASSED
MOT TEST: 18 May 2017 13:34:24 PASSED

This test (730720607006) was completed on the 18 May 2017 13:34:24 and PASSED the requirements for a valid MOT with 2 comments.

This test (730720607006) was completed on the 18 May 2017 13:34:24 and PASSED the requirements for a valid MOT with 2 comments.

Recorded mileage: 1,076

Recorded mileage: 1,076


ADVISORY


MOT TEST: 09 May 2017 11:00:30 FAILED
MOT TEST: 09 May 2017 11:00:30 FAILED

This test (347319832240) was completed on the 09 May 2017 11:00:30 and FAILED the requirements for a valid MOT with 10 comments.

This test (347319832240) was completed on the 09 May 2017 11:00:30 and FAILED the requirements for a valid MOT with 10 comments.

Recorded mileage: 1,075

Recorded mileage: 1,075


ADVISORY

FAIL


MOT TEST: 16 March 2013 12:16:11 PASSED
MOT TEST: 16 March 2013 12:16:11 PASSED

This test (386975773029) was completed on the 16 March 2013 12:16:11 and PASSED the requirements for a valid MOT with 1 comments.

This test (386975773029) was completed on the 16 March 2013 12:16:11 and PASSED the requirements for a valid MOT with 1 comments.

Recorded mileage: 1,063

Recorded mileage: 1,063


USER ENTERED