442 8FH


4428FH is registered to a Blue 1961, Morris Minor with a Petrol engine. It Passed its most recent MOT Test on the 14 February 2019

26 unique faults (30 Total) reported in its MOT History (19 Tests).

4 common/recurring faults, the most frequent (2 times) is: Steering column top bearing slightly worn (2.1.2c).

74% (14) MOT Pass Rate and a 26% (5) MOT Failure Rate.

6,597 recorded miles.

442 8FH


4428FH is registered to a Blue 1961, Morris Minor with a Petrol engine. It Passed its most recent MOT Test on the 14 February 2019

26 unique faults (30 Total) reported in its MOT History (19 Tests).

4 common/recurring faults, the most frequent (2 times) is: Steering column top bearing slightly worn (2.1.2c).

74% (14) MOT Pass Rate and a 26% (5) MOT Failure Rate.

6,597 recorded miles.

MOT PASS/Failure rate for 442 8FH

all MOT test results for 442 8FH represented as a percentage
MOT PASS/Failure rate for 442 8FH
all MOT test results for 442 8FH represented as a percentage

PERCENTAGE OF VEHICLE FAULTS WITH 442 8FH

ALL REPORTED FAULTS, DISPLAYED BY PERCENTAGE OF OCCURRENCE DURING ALL MOT TESTS
PERCENTAGE OF VEHICLE FAULTS WITH 442 8FH
ALL REPORTED FAULTS, DISPLAYED BY PERCENTAGE OF OCCURRENCE DURING ALL MOT TESTS
ADVISORY

FAIL

442 8FH annual Faults by type

ALL REPORTED FAULTS, DISPLAYED over time and categorised by type
442 8FH annual Faults by type
ALL REPORTED FAULTS, DISPLAYED over time and categorised by type

RECURRING FAULTS WITH 442 8FH

FAULTS THAT HAVE OCCURED MORE THAN ONCE DURING 442 8FH's MOT HISTORY
RECURRING FAULTS WITH 442 8FH
FAULTS THAT HAVE OCCURED MORE THAN ONCE DURING 442 8FH's MOT HISTORY
Fault Fault Test Date Test Date/Time Reference MOT Test Reference
2 Steering column top bearing slightly worn (2.1.2c) Steering column top bearing slightly worn (2.1.2c) 17 February 2017 [15:45] 17/02/2017 17 February 2017 [13:00] 17/02/2017 434260652983 434260652983 559361887602 559361887602
2 Nearside front wheel bearing has slight play (2.5.a.3c) Nearside front wheel bearing has slight play (2.5.a.3c) 17 February 2017 [15:45] 17/02/2017 17 February 2017 [13:00] 17/02/2017 434260652983 434260652983 559361887602 559361887602
2 Nearside rear wheel bearing has slight play (2.6.2) Nearside rear wheel bearing has slight play (2.6.2) 17 February 2017 [15:45] 17/02/2017 17 February 2017 [13:00] 17/02/2017 434260652983 434260652983 559361887602 559361887602
2 Offside play in steering rack inner joint(s) () Offside play in steering rack inner joint(s) () 17 February 2017 [15:45] 17/02/2017 17 February 2017 [13:00] 17/02/2017 434260652983 434260652983 559361887602 559361887602

ALL 442 8FH ADVISORIES [10]

ALL ADVISORIES, ORDERED by OCCURRENCE DURING 442 8FH's MOT HISTORY
ALL 442 8FH ADVISORIES [10]
ALL ADVISORIES, ORDERED by OCCURRENCE DURING 442 8FH's MOT HISTORY
Advisory Faults | source www.vehiclestats.co.uk
Fault Fault Test Date Test Date/Time Reference MOT Test Reference
2 Steering column top bearing slightly worn (2.1.2c) Steering column top bearing slightly worn (2.1.2c) 17 February 2017 [15:45] 17/02/2017 17 February 2017 [13:00] 17/02/2017 434260652983 434260652983 559361887602 559361887602
2 Nearside front wheel bearing has slight play (2.5.a.3c) Nearside front wheel bearing has slight play (2.5.a.3c) 17 February 2017 [15:45] 17/02/2017 17 February 2017 [13:00] 17/02/2017 434260652983 434260652983 559361887602 559361887602
2 Nearside rear wheel bearing has slight play (2.6.2) Nearside rear wheel bearing has slight play (2.6.2) 17 February 2017 [15:45] 17/02/2017 17 February 2017 [13:00] 17/02/2017 434260652983 434260652983 559361887602 559361887602
2 Offside play in steering rack inner joint(s) () Offside play in steering rack inner joint(s) () 17 February 2017 [15:45] 17/02/2017 17 February 2017 [13:00] 17/02/2017 434260652983 434260652983 559361887602 559361887602
1 Nearside front upper suspension arm pin or bush worn but not resulting in excessive movement (5.3.4 (a) (i)) Nearside front upper suspension arm pin or bush worn but not resulting in excessive movement (5.3.4 (a) (i)) 12 February 2019 [12:30] 12/02/2019 220572546267 220572546267
1 Nearside front wheel bearing has slight play (5.1.3 (a) (i)) Nearside front wheel bearing has slight play (5.1.3 (a) (i)) 12 February 2019 [12:30] 12/02/2019 220572546267 220572546267

ALL 442 8FH Failure Faults [20]

ALL Failure faults, ORDERED by OCCURRENCE DURING 442 8FH's MOT HISTORY
ALL 442 8FH Failure Faults [20]
ALL Failure faults, ORDERED by OCCURRENCE DURING 442 8FH's MOT HISTORY
Fail Faults | source www.vehiclestats.co.uk
Fault Fault Test Date Test Date/Time Reference MOT Test Reference
1 Steering column top bearing excessively worn (2.2.2 (b)) Steering column top bearing excessively worn (2.2.2 (b)) 12 February 2019 [12:30] 12/02/2019 220572546267 220572546267
1 Rear brakes imbalanced across an axle (1.2.1 (b) (i)) Rear brakes imbalanced across an axle (1.2.1 (b) (i)) 12 February 2019 [12:30] 12/02/2019 220572546267 220572546267
1 Front brakes imbalanced across an axle by more than 50% (1.2.1 (b) (ii)) Front brakes imbalanced across an axle by more than 50% (1.2.1 (b) (ii)) 12 February 2019 [12:30] 12/02/2019 220572546267 220572546267
1 Parking brake efficiency below requirements (1.4.2 (a) (i)) Parking brake efficiency below requirements (1.4.2 (a) (i)) 12 February 2019 [12:30] 12/02/2019 220572546267 220572546267
1 Nearside steering rack gaiter split (2.2.d.2d) Nearside steering rack gaiter split (2.2.d.2d) 17 February 2017 [13:00] 17/02/2017 559361887602 559361887602
1 Front brakes imbalanced across an axle (3.7.b.5b) Front brakes imbalanced across an axle (3.7.b.5b) 17 February 2017 [13:00] 17/02/2017 559361887602 559361887602
1 Rear brake application uneven (3.7.b.2) Rear brake application uneven (3.7.b.2) 17 February 2017 [13:00] 17/02/2017 559361887602 559361887602
1 Rear parking (secondary) brakes imbalanced (3.7.b.6b) Rear parking (secondary) brakes imbalanced (3.7.b.6b) 17 February 2017 [13:00] 17/02/2017 559361887602 559361887602
1 Parking brake: efficiency below requirements (3.7.b.7) Parking brake: efficiency below requirements (3.7.b.7) 17 February 2017 [13:00] 17/02/2017 559361887602 559361887602
1 Rear brakes imbalanced across an axle axle 2 (3.7.b.5b) Rear brakes imbalanced across an axle axle 2 (3.7.b.5b) 17 February 2017 [13:00] 17/02/2017 559361887602 559361887602
1 Offside rear brake binding (3.7.b.1) Offside rear brake binding (3.7.b.1) 08 February 2016 [10:55] 08/02/2016 613076920422 613076920422
1 Offside front suspension has an insecurely locked unit in the upper support bearing assembly (2.5.b.3b) Offside front suspension has an insecurely locked unit in the upper support bearing assembly (2.5.b.3b) 08 February 2016 [10:55] 08/02/2016 613076920422 613076920422
1 Offside headlamp not working on dipped beam (1.7.5a) Offside headlamp not working on dipped beam (1.7.5a) 08 February 2016 [10:55] 08/02/2016 613076920422 613076920422
1 Offside front upper axle swivel joint has excessive play in a swivel pin (2.5.a.3b) Offside front upper axle swivel joint has excessive play in a swivel pin (2.5.a.3b) 14 February 2012 [11:52] 14/02/2012 408065042029 408065042029
1 Front windscreen washer provides insufficient washer liquid (8.2.3) Front windscreen washer provides insufficient washer liquid (8.2.3) 21 February 2006 [15:30] 21/02/2006 582782056036 582782056036
1 Nearside rear shock absorber has a serious fluid leak (2.7.3) Nearside rear shock absorber has a serious fluid leak (2.7.3) 21 February 2006 [15:30] 21/02/2006 582782056036 582782056036
1 Nearside rear rear position lamp(s) excessively deteriorated so that it is not visible from a reasonable distance (1.1.a.3d) Nearside rear rear position lamp(s) excessively deteriorated so that it is not visible from a reasonable distance (1.1.a.3d) 21 February 2006 [15:30] 21/02/2006 582782056036 582782056036
1 Nearside headlamp aim too low (1.6.d2) Nearside headlamp aim too low (1.6.d2) 21 February 2006 [15:30] 21/02/2006 582782056036 582782056036
1 Nearside front direction indicator not working (1.4.a.2c) Nearside front direction indicator not working (1.4.a.2c) 21 February 2006 [15:30] 21/02/2006 582782056036 582782056036
1 Indicator tell tale inoperative (1.4.a.2a) Indicator tell tale inoperative (1.4.a.2a) 21 February 2006 [15:30] 21/02/2006 582782056036 582782056036

MOT TEST: 14 February 2019 16:39:54 PASSED
MOT TEST: 14 February 2019 16:39:54 PASSED

This test (336941221515) was completed on the 14 February 2019 16:39:54 and PASSED the requirements for a valid MOT with 0 comments.

This test (336941221515) was completed on the 14 February 2019 16:39:54 and PASSED the requirements for a valid MOT with 0 comments.

Recorded mileage: 6,597

Recorded mileage: 6,597


MOT TEST: 12 February 2019 12:30:45 FAILED
MOT TEST: 12 February 2019 12:30:45 FAILED

This test (220572546267) was completed on the 12 February 2019 12:30:45 and FAILED the requirements for a valid MOT with 6 comments.

This test (220572546267) was completed on the 12 February 2019 12:30:45 and FAILED the requirements for a valid MOT with 6 comments.

Recorded mileage: 6,593

Recorded mileage: 6,593


ADVISORY

FAIL


MOT TEST: 07 February 2018 08:57:06 PASSED
MOT TEST: 07 February 2018 08:57:06 PASSED

This test (285221075282) was completed on the 07 February 2018 08:57:06 and PASSED the requirements for a valid MOT with 0 comments.

This test (285221075282) was completed on the 07 February 2018 08:57:06 and PASSED the requirements for a valid MOT with 0 comments.

Recorded mileage: 6,540

Recorded mileage: 6,540


MOT TEST: 17 February 2017 15:45:55 PASSED
MOT TEST: 17 February 2017 15:45:55 PASSED

This test (434260652983) was completed on the 17 February 2017 15:45:55 and PASSED the requirements for a valid MOT with 4 comments.

This test (434260652983) was completed on the 17 February 2017 15:45:55 and PASSED the requirements for a valid MOT with 4 comments.

Recorded mileage: 6,498

Recorded mileage: 6,498


ADVISORY


MOT TEST: 17 February 2017 13:00:06 FAILED
MOT TEST: 17 February 2017 13:00:06 FAILED

This test (559361887602) was completed on the 17 February 2017 13:00:06 and FAILED the requirements for a valid MOT with 10 comments.

This test (559361887602) was completed on the 17 February 2017 13:00:06 and FAILED the requirements for a valid MOT with 10 comments.

Recorded mileage: 6,495

Recorded mileage: 6,495


ADVISORY

FAIL


MOT TEST: 11 February 2016 10:59:28 PASSED
MOT TEST: 11 February 2016 10:59:28 PASSED

This test (419491088138) was completed on the 11 February 2016 10:59:28 and PASSED the requirements for a valid MOT with 0 comments.

This test (419491088138) was completed on the 11 February 2016 10:59:28 and PASSED the requirements for a valid MOT with 0 comments.

Recorded mileage: 6,332

Recorded mileage: 6,332


MOT TEST: 08 February 2016 10:55:07 FAILED
MOT TEST: 08 February 2016 10:55:07 FAILED

This test (613076920422) was completed on the 08 February 2016 10:55:07 and FAILED the requirements for a valid MOT with 3 comments.

This test (613076920422) was completed on the 08 February 2016 10:55:07 and FAILED the requirements for a valid MOT with 3 comments.

Recorded mileage: 6,332

Recorded mileage: 6,332


FAIL


MOT TEST: 18 February 2015 09:51:28 PASSED
MOT TEST: 18 February 2015 09:51:28 PASSED

This test (528339745017) was completed on the 18 February 2015 09:51:28 and PASSED the requirements for a valid MOT with 0 comments.

This test (528339745017) was completed on the 18 February 2015 09:51:28 and PASSED the requirements for a valid MOT with 0 comments.

Recorded mileage: 6,265

Recorded mileage: 6,265


MOT TEST: 26 February 2014 10:46:08 PASSED
MOT TEST: 26 February 2014 10:46:08 PASSED

This test (939937354097) was completed on the 26 February 2014 10:46:08 and PASSED the requirements for a valid MOT with 0 comments.

This test (939937354097) was completed on the 26 February 2014 10:46:08 and PASSED the requirements for a valid MOT with 0 comments.

Recorded mileage: 6,179

Recorded mileage: 6,179


MOT TEST: 05 March 2013 09:59:10 PASSED
MOT TEST: 05 March 2013 09:59:10 PASSED

This test (968694063061) was completed on the 05 March 2013 09:59:10 and PASSED the requirements for a valid MOT with 0 comments.

This test (968694063061) was completed on the 05 March 2013 09:59:10 and PASSED the requirements for a valid MOT with 0 comments.

Recorded mileage: 5,949

Recorded mileage: 5,949


MOT TEST: 15 February 2012 15:55:57 PASSED
MOT TEST: 15 February 2012 15:55:57 PASSED

This test (237996742025) was completed on the 15 February 2012 15:55:57 and PASSED the requirements for a valid MOT with 0 comments.

This test (237996742025) was completed on the 15 February 2012 15:55:57 and PASSED the requirements for a valid MOT with 0 comments.

Recorded mileage: 5,529

Recorded mileage: 5,529


MOT TEST: 14 February 2012 11:52:23 FAILED
MOT TEST: 14 February 2012 11:52:23 FAILED

This test (408065042029) was completed on the 14 February 2012 11:52:23 and FAILED the requirements for a valid MOT with 1 comments.

This test (408065042029) was completed on the 14 February 2012 11:52:23 and FAILED the requirements for a valid MOT with 1 comments.

Recorded mileage: 5,529

Recorded mileage: 5,529


FAIL


MOT TEST: 28 February 2011 10:16:44 PASSED
MOT TEST: 28 February 2011 10:16:44 PASSED

This test (639319651069) was completed on the 28 February 2011 10:16:44 and PASSED the requirements for a valid MOT with 0 comments.

This test (639319651069) was completed on the 28 February 2011 10:16:44 and PASSED the requirements for a valid MOT with 0 comments.

Recorded mileage: 5,212

Recorded mileage: 5,212


MOT TEST: 08 March 2010 12:40:16 PASSED
MOT TEST: 08 March 2010 12:40:16 PASSED

This test (420867460085) was completed on the 08 March 2010 12:40:16 and PASSED the requirements for a valid MOT with 0 comments.

This test (420867460085) was completed on the 08 March 2010 12:40:16 and PASSED the requirements for a valid MOT with 0 comments.

Recorded mileage: 5,192

Recorded mileage: 5,192


MOT TEST: 02 March 2009 11:20:59 PASSED
MOT TEST: 02 March 2009 11:20:59 PASSED

This test (313231369012) was completed on the 02 March 2009 11:20:59 and PASSED the requirements for a valid MOT with 0 comments.

This test (313231369012) was completed on the 02 March 2009 11:20:59 and PASSED the requirements for a valid MOT with 0 comments.

Recorded mileage: 5,149

Recorded mileage: 5,149


MOT TEST: 25 February 2008 12:04:41 PASSED
MOT TEST: 25 February 2008 12:04:41 PASSED

This test (593616558046) was completed on the 25 February 2008 12:04:41 and PASSED the requirements for a valid MOT with 0 comments.

This test (593616558046) was completed on the 25 February 2008 12:04:41 and PASSED the requirements for a valid MOT with 0 comments.

Recorded mileage: 4,965

Recorded mileage: 4,965


MOT TEST: 22 February 2007 10:40:56 PASSED
MOT TEST: 22 February 2007 10:40:56 PASSED

This test (113303357026) was completed on the 22 February 2007 10:40:56 and PASSED the requirements for a valid MOT with 0 comments.

This test (113303357026) was completed on the 22 February 2007 10:40:56 and PASSED the requirements for a valid MOT with 0 comments.

Recorded mileage: 4,162

Recorded mileage: 4,162


MOT TEST: 23 February 2006 11:20:31 PASSED
MOT TEST: 23 February 2006 11:20:31 PASSED

This test (844604556033) was completed on the 23 February 2006 11:20:31 and PASSED the requirements for a valid MOT with 0 comments.

This test (844604556033) was completed on the 23 February 2006 11:20:31 and PASSED the requirements for a valid MOT with 0 comments.

Recorded mileage: 3,950

Recorded mileage: 3,950


MOT TEST: 21 February 2006 15:30:54 FAILED
MOT TEST: 21 February 2006 15:30:54 FAILED

This test (582782056036) was completed on the 21 February 2006 15:30:54 and FAILED the requirements for a valid MOT with 6 comments.

This test (582782056036) was completed on the 21 February 2006 15:30:54 and FAILED the requirements for a valid MOT with 6 comments.

Recorded mileage: 3,949

Recorded mileage: 3,949


FAIL