451 SPE


451SPE is registered to a Green 1960, Morris Minor with a Petrol engine. It Failed its most recent MOT Test on the 05 December 2017

28 unique faults (33 Total) reported in its MOT History (18 Tests).

4 common/recurring faults, the most frequent (3 times) is: Brakes imbalanced requirements only just met. It would appear that the braking system requires adjustment or repair. (3.7.B.5b).

72% (13) MOT Pass Rate and a 28% (5) MOT Failure Rate.

76,642 recorded miles.

451 SPE


451SPE is registered to a Green 1960, Morris Minor with a Petrol engine. It Failed its most recent MOT Test on the 05 December 2017

28 unique faults (33 Total) reported in its MOT History (18 Tests).

4 common/recurring faults, the most frequent (3 times) is: Brakes imbalanced requirements only just met. It would appear that the braking system requires adjustment or repair. (3.7.B.5b).

72% (13) MOT Pass Rate and a 28% (5) MOT Failure Rate.

76,642 recorded miles.

MOT PASS/Failure rate for 451 SPE

all MOT test results for 451 SPE represented as a percentage
MOT PASS/Failure rate for 451 SPE
all MOT test results for 451 SPE represented as a percentage

PERCENTAGE OF VEHICLE FAULTS WITH 451 SPE

ALL REPORTED FAULTS, DISPLAYED BY PERCENTAGE OF OCCURRENCE DURING ALL MOT TESTS
PERCENTAGE OF VEHICLE FAULTS WITH 451 SPE
ALL REPORTED FAULTS, DISPLAYED BY PERCENTAGE OF OCCURRENCE DURING ALL MOT TESTS
ADVISORY

FAIL

USER ENTERED

451 SPE annual Faults by type

ALL REPORTED FAULTS, DISPLAYED over time and categorised by type
451 SPE annual Faults by type
ALL REPORTED FAULTS, DISPLAYED over time and categorised by type

RECURRING FAULTS WITH 451 SPE

FAULTS THAT HAVE OCCURED MORE THAN ONCE DURING 451 SPE's MOT HISTORY
RECURRING FAULTS WITH 451 SPE
FAULTS THAT HAVE OCCURED MORE THAN ONCE DURING 451 SPE's MOT HISTORY
Fault Fault Test Date Test Date/Time Reference MOT Test Reference
3 Brakes imbalanced requirements only just met. It would appear that the braking system requires adjustment or repair. (3.7.b.5b) Brakes imbalanced requirements only just met. It would appear that the braking system requires adjustment or repair. (3.7.b.5b) 17 November 2012 [14:11] 17/11/2012 19 November 2011 [11:55] 19/11/2011 27 November 2010 [10:34] 27/11/2010 127422122331 127422122331 945453121356 945453121356 432581730405 432581730405
2 Offside front front suspension has slight play in a lower suspension ball joint (2.5.b.1a) Offside front front suspension has slight play in a lower suspension ball joint (2.5.b.1a) 19 November 2011 [11:55] 19/11/2011 21 November 2007 [15:24] 21/11/2007 945453121356 945453121356 703405727379 703405727379
2 Parking brake lever has little reserve travel (3.1.6b) Parking brake lever has little reserve travel (3.1.6b) 27 November 2010 [10:43] 27/11/2010 27 November 2010 [10:34] 27/11/2010 931571130336 931571130336 432581730405 432581730405
2 Front wheel bearing has slight play (2.5.a.3c) Front wheel bearing has slight play (2.5.a.3c) 27 November 2010 [10:43] 27/11/2010 27 November 2010 [10:34] 27/11/2010 931571130336 931571130336 432581730405 432581730405

ALL 451 SPE ADVISORIES [18]

ALL ADVISORIES, ORDERED by OCCURRENCE DURING 451 SPE's MOT HISTORY
ALL 451 SPE ADVISORIES [18]
ALL ADVISORIES, ORDERED by OCCURRENCE DURING 451 SPE's MOT HISTORY
Advisory Faults | source www.vehiclestats.co.uk
Fault Fault Test Date Test Date/Time Reference MOT Test Reference
3 Brakes imbalanced requirements only just met. It would appear that the braking system requires adjustment or repair. (3.7.b.5b) Brakes imbalanced requirements only just met. It would appear that the braking system requires adjustment or repair. (3.7.b.5b) 17 November 2012 [14:11] 17/11/2012 19 November 2011 [11:55] 19/11/2011 27 November 2010 [10:34] 27/11/2010 127422122331 127422122331 945453121356 945453121356 432581730405 432581730405
2 Offside front front suspension has slight play in a lower suspension ball joint (2.5.b.1a) Offside front front suspension has slight play in a lower suspension ball joint (2.5.b.1a) 19 November 2011 [11:55] 19/11/2011 21 November 2007 [15:24] 21/11/2007 945453121356 945453121356 703405727379 703405727379
2 Parking brake lever has little reserve travel (3.1.6b) Parking brake lever has little reserve travel (3.1.6b) 27 November 2010 [10:43] 27/11/2010 27 November 2010 [10:34] 27/11/2010 931571130336 931571130336 432581730405 432581730405
2 Front wheel bearing has slight play (2.5.a.3c) Front wheel bearing has slight play (2.5.a.3c) 27 November 2010 [10:43] 27/11/2010 27 November 2010 [10:34] 27/11/2010 931571130336 931571130336 432581730405 432581730405
1 Nearside front suspension component mounting prescribed area is corroded but not considered excessive (2.4.a.3) Nearside front suspension component mounting prescribed area is corroded but not considered excessive (2.4.a.3) 19 November 2015 [11:52] 19/11/2015 961012964404 961012964404
1 Offside front suspension component mounting prescribed area is corroded but not considered excessive (2.4.a.3) Offside front suspension component mounting prescribed area is corroded but not considered excessive (2.4.a.3) 19 November 2015 [11:52] 19/11/2015 961012964404 961012964404
1 Nearside rear suspension component mounting prescribed area is corroded but not considered excessive (2.4.a.3) Nearside rear suspension component mounting prescribed area is corroded but not considered excessive (2.4.a.3) 19 November 2015 [11:52] 19/11/2015 961012964404 961012964404
1 Offside rear suspension component mounting prescribed area is corroded but not considered excessive (2.4.a.3) Offside rear suspension component mounting prescribed area is corroded but not considered excessive (2.4.a.3) 19 November 2015 [11:52] 19/11/2015 961012964404 961012964404
1 Service brake: service brake efficiency only just met. It would appear that the braking system requires adjustment or repair. (3.7.b.7) Service brake: service brake efficiency only just met. It would appear that the braking system requires adjustment or repair. (3.7.b.7) 27 November 2010 [10:34] 27/11/2010 432581730405 432581730405
1 Nearside front shock absorber has a light misting of oil (2.7.3) Nearside front shock absorber has a light misting of oil (2.7.3) 21 November 2007 [15:24] 21/11/2007 703405727379 703405727379
1 Offside front shock absorber has a light misting of oil (2.7.3) Offside front shock absorber has a light misting of oil (2.7.3) 21 November 2007 [15:24] 21/11/2007 703405727379 703405727379
1 Nearside front front wheel bearing has slight play (2.5.a.3c) Nearside front front wheel bearing has slight play (2.5.a.3c) 21 November 2007 [15:24] 21/11/2007 703405727379 703405727379
1 Nearside front front suspension has slight play in a lower suspension ball joint (2.5.b.1a) Nearside front front suspension has slight play in a lower suspension ball joint (2.5.b.1a) 21 November 2007 [15:24] 21/11/2007 703405727379 703405727379

ALL 451 SPE Failure Faults [9]

ALL Failure faults, ORDERED by OCCURRENCE DURING 451 SPE's MOT HISTORY
ALL 451 SPE Failure Faults [9]
ALL Failure faults, ORDERED by OCCURRENCE DURING 451 SPE's MOT HISTORY
Fail Faults | source www.vehiclestats.co.uk
Fault Fault Test Date Test Date/Time Reference MOT Test Reference
1 Windscreen washer provides insufficient washer liquid (8.2.3) Windscreen washer provides insufficient washer liquid (8.2.3) 19 November 2015 [11:52] 19/11/2015 961012964404 961012964404
1 Offside rear direction indicator not working (1.4.a.2c) Offside rear direction indicator not working (1.4.a.2c) 19 November 2015 [11:52] 19/11/2015 961012964404 961012964404
1 Offside front brake binding (3.7.b.1) Offside front brake binding (3.7.b.1) 22 November 2014 [11:34] 22/11/2014 185436524363 185436524363
1 Nearside rear brake binding (3.7.b.1) Nearside rear brake binding (3.7.b.1) 22 November 2014 [11:34] 22/11/2014 185436524363 185436524363
1 Horn not working (1.6.2a) Horn not working (1.6.2a) 23 November 2013 [10:14] 23/11/2013 676097523366 676097523366
1 Semaphore indicator arm does not extend smoothly (1.4.c.1a) Semaphore indicator arm does not extend smoothly (1.4.c.1a) 27 November 2010 [10:34] 27/11/2010 432581730405 432581730405
1 Semaphore indicator arm arm does not show an amber light to the front (1.4.c.1b) Semaphore indicator arm arm does not show an amber light to the front (1.4.c.1b) 27 November 2010 [10:34] 27/11/2010 432581730405 432581730405
1 Semaphore indicator arm arm does not show an amber light to the rear (1.4.c.1b) Semaphore indicator arm arm does not show an amber light to the rear (1.4.c.1b) 27 November 2010 [10:34] 27/11/2010 432581730405 432581730405
1 Nearside inner suspension component mounting prescribed area is excessively corroded (2.4.a.3) Nearside inner suspension component mounting prescribed area is excessively corroded (2.4.a.3) 21 November 2007 [15:24] 21/11/2007 703405727379 703405727379

ALL 451 SPE User Entered Faults [6]

ALL User Entered faults, ORDERED by OCCURRENCE DURING 451 SPE's MOT HISTORY
ALL 451 SPE User Entered Faults [6]
ALL User Entered faults, ORDERED by OCCURRENCE DURING 451 SPE's MOT HISTORY
Fail Faults | source www.vehiclestats.co.uk
Fault Fault Test Date Test Date/Time Reference MOT Test Reference
1 Engine spark plug lose Engine spark plug lose 23 November 2013 [10:14] 23/11/2013 676097523366 676097523366
1 No seat belts fitted(age exempt) No seat belts fitted(age exempt) 17 November 2012 [14:11] 17/11/2012 127422122331 127422122331
1 Semafor arms disconected & not in use. Indicator lamps fitted Semafor arms disconected & not in use. Indicator lamps fitted 17 November 2012 [14:11] 17/11/2012 127422122331 127422122331
1 No hazard lights (age exempt) No hazard lights (age exempt) 17 November 2012 [14:11] 17/11/2012 127422122331 127422122331
1 No rear fog light (age exempt) No rear fog light (age exempt) 17 November 2012 [14:11] 17/11/2012 127422122331 127422122331
1 Visual smoke test only Visual smoke test only 17 November 2012 [14:11] 17/11/2012 127422122331 127422122331

MOT TEST: 05 December 2017 12:35:54 PASSED
MOT TEST: 05 December 2017 12:35:54 PASSED

This test (636531988331) was completed on the 05 December 2017 12:35:54 and PASSED the requirements for a valid MOT with 0 comments.

This test (636531988331) was completed on the 05 December 2017 12:35:54 and PASSED the requirements for a valid MOT with 0 comments.

Recorded mileage: 76,642

Recorded mileage: 76,642


MOT TEST: 01 December 2016 14:29:45 PASSED
MOT TEST: 01 December 2016 14:29:45 PASSED

This test (460132702999) was completed on the 01 December 2016 14:29:45 and PASSED the requirements for a valid MOT with 0 comments.

This test (460132702999) was completed on the 01 December 2016 14:29:45 and PASSED the requirements for a valid MOT with 0 comments.

Recorded mileage: 76,642

Recorded mileage: 76,642


MOT TEST: 30 November 2015 12:40:28 PASSED
MOT TEST: 30 November 2015 12:40:28 PASSED

This test (843422222757) was completed on the 30 November 2015 12:40:28 and PASSED the requirements for a valid MOT with 0 comments.

This test (843422222757) was completed on the 30 November 2015 12:40:28 and PASSED the requirements for a valid MOT with 0 comments.

Recorded mileage: 76,642

Recorded mileage: 76,642


MOT TEST: 19 November 2015 11:52:16 FAILED
MOT TEST: 19 November 2015 11:52:16 FAILED

This test (961012964404) was completed on the 19 November 2015 11:52:16 and FAILED the requirements for a valid MOT with 6 comments.

This test (961012964404) was completed on the 19 November 2015 11:52:16 and FAILED the requirements for a valid MOT with 6 comments.

Recorded mileage: 76,642

Recorded mileage: 76,642


ADVISORY

FAIL


MOT TEST: 24 November 2014 11:24:56 PASSED
MOT TEST: 24 November 2014 11:24:56 PASSED

This test (298248424331) was completed on the 24 November 2014 11:24:56 and PASSED the requirements for a valid MOT with 0 comments.

This test (298248424331) was completed on the 24 November 2014 11:24:56 and PASSED the requirements for a valid MOT with 0 comments.

Recorded mileage: 76,642

Recorded mileage: 76,642


MOT TEST: 22 November 2014 11:34:15 FAILED
MOT TEST: 22 November 2014 11:34:15 FAILED

This test (185436524363) was completed on the 22 November 2014 11:34:15 and FAILED the requirements for a valid MOT with 2 comments.

This test (185436524363) was completed on the 22 November 2014 11:34:15 and FAILED the requirements for a valid MOT with 2 comments.

Recorded mileage: 76,642

Recorded mileage: 76,642


FAIL


MOT TEST: 23 November 2013 11:12:46 PASSED
MOT TEST: 23 November 2013 11:12:46 PASSED

This test (608577823367) was completed on the 23 November 2013 11:12:46 and PASSED the requirements for a valid MOT with 0 comments.

This test (608577823367) was completed on the 23 November 2013 11:12:46 and PASSED the requirements for a valid MOT with 0 comments.

Recorded mileage: 76,642

Recorded mileage: 76,642


MOT TEST: 23 November 2013 10:14:21 FAILED
MOT TEST: 23 November 2013 10:14:21 FAILED

This test (676097523366) was completed on the 23 November 2013 10:14:21 and FAILED the requirements for a valid MOT with 2 comments.

This test (676097523366) was completed on the 23 November 2013 10:14:21 and FAILED the requirements for a valid MOT with 2 comments.

Recorded mileage: 76,642

Recorded mileage: 76,642


FAIL

USER ENTERED


MOT TEST: 17 November 2012 14:11:43 PASSED
MOT TEST: 17 November 2012 14:11:43 PASSED

This test (127422122331) was completed on the 17 November 2012 14:11:43 and PASSED the requirements for a valid MOT with 6 comments.

This test (127422122331) was completed on the 17 November 2012 14:11:43 and PASSED the requirements for a valid MOT with 6 comments.

Recorded mileage: 76,642

Recorded mileage: 76,642


ADVISORY

USER ENTERED


MOT TEST: 19 November 2011 11:55:13 PASSED
MOT TEST: 19 November 2011 11:55:13 PASSED

This test (945453121356) was completed on the 19 November 2011 11:55:13 and PASSED the requirements for a valid MOT with 2 comments.

This test (945453121356) was completed on the 19 November 2011 11:55:13 and PASSED the requirements for a valid MOT with 2 comments.

Recorded mileage: 76,642

Recorded mileage: 76,642


ADVISORY


MOT TEST: 27 November 2010 10:43:12 PASSED
MOT TEST: 27 November 2010 10:43:12 PASSED

This test (931571130336) was completed on the 27 November 2010 10:43:12 and PASSED the requirements for a valid MOT with 2 comments.

This test (931571130336) was completed on the 27 November 2010 10:43:12 and PASSED the requirements for a valid MOT with 2 comments.

Recorded mileage: 76,642

Recorded mileage: 76,642


ADVISORY


MOT TEST: 27 November 2010 10:34:33 FAILED
MOT TEST: 27 November 2010 10:34:33 FAILED

This test (432581730405) was completed on the 27 November 2010 10:34:33 and FAILED the requirements for a valid MOT with 7 comments.

This test (432581730405) was completed on the 27 November 2010 10:34:33 and FAILED the requirements for a valid MOT with 7 comments.

Recorded mileage: 76,642

Recorded mileage: 76,642


ADVISORY

FAIL


MOT TEST: 28 November 2009 11:12:46 PASSED
MOT TEST: 28 November 2009 11:12:46 PASSED

This test (490242639430) was completed on the 28 November 2009 11:12:46 and PASSED the requirements for a valid MOT with 0 comments.

This test (490242639430) was completed on the 28 November 2009 11:12:46 and PASSED the requirements for a valid MOT with 0 comments.

Recorded mileage: 76,642

Recorded mileage: 76,642


MOT TEST: 15 November 2008 09:45:19 PASSED
MOT TEST: 15 November 2008 09:45:19 PASSED

This test (413080128326) was completed on the 15 November 2008 09:45:19 and PASSED the requirements for a valid MOT with 0 comments.

This test (413080128326) was completed on the 15 November 2008 09:45:19 and PASSED the requirements for a valid MOT with 0 comments.

Recorded mileage: 76,642

Recorded mileage: 76,642


MOT TEST: 29 November 2007 14:35:38 PASSED
MOT TEST: 29 November 2007 14:35:38 PASSED

This test (103753637322) was completed on the 29 November 2007 14:35:38 and PASSED the requirements for a valid MOT with 0 comments.

This test (103753637322) was completed on the 29 November 2007 14:35:38 and PASSED the requirements for a valid MOT with 0 comments.

Recorded mileage: 76,642

Recorded mileage: 76,642


MOT TEST: 21 November 2007 15:24:02 FAILED
MOT TEST: 21 November 2007 15:24:02 FAILED

This test (703405727379) was completed on the 21 November 2007 15:24:02 and FAILED the requirements for a valid MOT with 6 comments.

This test (703405727379) was completed on the 21 November 2007 15:24:02 and FAILED the requirements for a valid MOT with 6 comments.

Recorded mileage: 76,642

Recorded mileage: 76,642


ADVISORY

FAIL


MOT TEST: 15 November 2006 13:23:48 PASSED
MOT TEST: 15 November 2006 13:23:48 PASSED

This test (251499216379) was completed on the 15 November 2006 13:23:48 and PASSED the requirements for a valid MOT with 0 comments.

This test (251499216379) was completed on the 15 November 2006 13:23:48 and PASSED the requirements for a valid MOT with 0 comments.

Recorded mileage: 76,642

Recorded mileage: 76,642


MOT TEST: 28 November 2005 12:46:59 PASSED
MOT TEST: 28 November 2005 12:46:59 PASSED

This test (710642035345) was completed on the 28 November 2005 12:46:59 and PASSED the requirements for a valid MOT with 0 comments.

This test (710642035345) was completed on the 28 November 2005 12:46:59 and PASSED the requirements for a valid MOT with 0 comments.

Recorded mileage: 76,642

Recorded mileage: 76,642