452 3MV


4523MV is registered to a Grey 1960, Morris Minor with a Petrol engine. It Passed its most recent MOT Test on the 06 November 2018

21 unique faults (32 Total) reported in its MOT History (19 Tests).

8 common/recurring faults, the most frequent (5 times) is: Windscreen washer provides insufficient washer liquid (8.2.3).

63% (12) MOT Pass Rate and a 37% (7) MOT Failure Rate.

47,339 recorded miles.

452 3MV


4523MV is registered to a Grey 1960, Morris Minor with a Petrol engine. It Passed its most recent MOT Test on the 06 November 2018

21 unique faults (32 Total) reported in its MOT History (19 Tests).

8 common/recurring faults, the most frequent (5 times) is: Windscreen washer provides insufficient washer liquid (8.2.3).

63% (12) MOT Pass Rate and a 37% (7) MOT Failure Rate.

47,339 recorded miles.

MOT PASS/Failure rate for 452 3MV

all MOT test results for 452 3MV represented as a percentage
MOT PASS/Failure rate for 452 3MV
all MOT test results for 452 3MV represented as a percentage

PERCENTAGE OF VEHICLE FAULTS WITH 452 3MV

ALL REPORTED FAULTS, DISPLAYED BY PERCENTAGE OF OCCURRENCE DURING ALL MOT TESTS
PERCENTAGE OF VEHICLE FAULTS WITH 452 3MV
ALL REPORTED FAULTS, DISPLAYED BY PERCENTAGE OF OCCURRENCE DURING ALL MOT TESTS
ADVISORY

FAIL

USER ENTERED

452 3MV annual Faults by type

ALL REPORTED FAULTS, DISPLAYED over time and categorised by type
452 3MV annual Faults by type
ALL REPORTED FAULTS, DISPLAYED over time and categorised by type

RECURRING FAULTS WITH 452 3MV

FAULTS THAT HAVE OCCURED MORE THAN ONCE DURING 452 3MV's MOT HISTORY
RECURRING FAULTS WITH 452 3MV
FAULTS THAT HAVE OCCURED MORE THAN ONCE DURING 452 3MV's MOT HISTORY
Fault Fault Test Date Test Date/Time Reference MOT Test Reference
5 Windscreen washer provides insufficient washer liquid (8.2.3) Windscreen washer provides insufficient washer liquid (8.2.3) 25 August 2017 [10:20] 25/08/2017 03 August 2016 [14:10] 03/08/2016 20 August 2015 [11:56] 20/08/2015 23 July 2014 [10:55] 23/07/2014 26 July 2013 [10:45] 26/07/2013 144792587250 144792587250 300592564284 300592564284 968476431404 968476431404 208744204209 208744204209 245627703260 245627703260
2 O/s/f brake binding slightly O/s/f brake binding slightly 25 August 2017 [13:39] 25/08/2017 25 August 2017 [10:20] 25/08/2017 642643568273 642643568273 144792587250 144792587250
2 No high beam tell-tale No high beam tell-tale 04 August 2016 [10:35] 04/08/2016 03 August 2016 [14:10] 03/08/2016 227831441781 227831441781 300592564284 300592564284
2 Offside front brake binding (3.7.b.1) Offside front brake binding (3.7.b.1) 03 August 2016 [14:10] 03/08/2016 02 August 2011 [16:13] 02/08/2011 300592564284 300592564284 968844011267 968844011267
2 Front suspension has slight play in a upper suspension ball joint slight lift in n/s/f upper trunnion (2.5.b.1a) Front suspension has slight play in a upper suspension ball joint slight lift in n/s/f upper trunnion (2.5.b.1a) 20 August 2015 [14:50] 20/08/2015 20 August 2015 [11:56] 20/08/2015 794059635389 794059635389 968476431404 968476431404
2 No seat belts No seat belts 23 July 2014 [12:21] 23/07/2014 23 July 2014 [10:55] 23/07/2014 745474904284 745474904284 208744204209 208744204209
2 Slight play in o/s/f lower trunnion Slight play in o/s/f lower trunnion 23 July 2014 [12:21] 23/07/2014 23 July 2014 [10:55] 23/07/2014 745474904284 745474904284 208744204209 208744204209
2 Seat belts not fitted and not required before 1965 Seat belts not fitted and not required before 1965 31 July 2013 [11:49] 31/07/2013 26 July 2013 [10:45] 26/07/2013 305212313400 305212313400 245627703260 245627703260

ALL 452 3MV ADVISORIES [6]

ALL ADVISORIES, ORDERED by OCCURRENCE DURING 452 3MV's MOT HISTORY
ALL 452 3MV ADVISORIES [6]
ALL ADVISORIES, ORDERED by OCCURRENCE DURING 452 3MV's MOT HISTORY
Advisory Faults | source www.vehiclestats.co.uk
Fault Fault Test Date Test Date/Time Reference MOT Test Reference
2 O/s/f brake binding slightly O/s/f brake binding slightly 25 August 2017 [13:39] 25/08/2017 25 August 2017 [10:20] 25/08/2017 642643568273 642643568273 144792587250 144792587250
2 No high beam tell-tale No high beam tell-tale 04 August 2016 [10:35] 04/08/2016 03 August 2016 [14:10] 03/08/2016 227831441781 227831441781 300592564284 300592564284
2 Front suspension has slight play in a upper suspension ball joint slight lift in n/s/f upper trunnion (2.5.b.1a) Front suspension has slight play in a upper suspension ball joint slight lift in n/s/f upper trunnion (2.5.b.1a) 20 August 2015 [14:50] 20/08/2015 20 August 2015 [11:56] 20/08/2015 794059635389 794059635389 968476431404 968476431404

ALL 452 3MV Failure Faults [19]

ALL Failure faults, ORDERED by OCCURRENCE DURING 452 3MV's MOT HISTORY
ALL 452 3MV Failure Faults [19]
ALL Failure faults, ORDERED by OCCURRENCE DURING 452 3MV's MOT HISTORY
Advisory Faults | source www.vehiclestats.co.uk
Fault Fault Test Date Test Date/Time Reference MOT Test Reference
5 Windscreen washer provides insufficient washer liquid (8.2.3) Windscreen washer provides insufficient washer liquid (8.2.3) 25 August 2017 [10:20] 25/08/2017 03 August 2016 [14:10] 03/08/2016 20 August 2015 [11:56] 20/08/2015 23 July 2014 [10:55] 23/07/2014 26 July 2013 [10:45] 26/07/2013 144792587250 144792587250 300592564284 300592564284 968476431404 968476431404 208744204209 208744204209 245627703260 245627703260
2 Offside front brake binding (3.7.b.1) Offside front brake binding (3.7.b.1) 03 August 2016 [14:10] 03/08/2016 02 August 2011 [16:13] 02/08/2011 300592564284 300592564284 968844011267 968844011267
1 Main beam 'tell-tale' not working (1.7.4c) Main beam 'tell-tale' not working (1.7.4c) 25 August 2017 [10:20] 25/08/2017 144792587250 144792587250
1 Nearside rear position lamp(s) not working (1.1.a.3b) Nearside rear position lamp(s) not working (1.1.a.3b) 25 August 2017 [10:20] 25/08/2017 144792587250 144792587250
1 Nearside stop lamp not working (1.2.1b) Nearside stop lamp not working (1.2.1b) 25 August 2017 [10:20] 25/08/2017 144792587250 144792587250
1 Offside stop lamp not working (1.2.1b) Offside stop lamp not working (1.2.1b) 25 August 2017 [10:20] 25/08/2017 144792587250 144792587250
1 Offside front front suspension has excessive play in a upper wishbone bearing (2.5.b.1a) Offside front front suspension has excessive play in a upper wishbone bearing (2.5.b.1a) 20 August 2015 [11:56] 20/08/2015 968476431404 968476431404
1 Offside front upper front suspension locking device missing trunnion bush securing nut loose (2.5.a.4) Offside front upper front suspension locking device missing trunnion bush securing nut loose (2.5.a.4) 20 August 2015 [11:56] 20/08/2015 968476431404 968476431404
1 Registration plate lamp not working (1.1.c.1d) Registration plate lamp not working (1.1.c.1d) 23 July 2014 [10:55] 23/07/2014 208744204209 208744204209
1 Offside rear rear brake binding (3.7.b.1) Offside rear rear brake binding (3.7.b.1) 26 July 2013 [10:45] 26/07/2013 245627703260 245627703260
1 Nearside rear rear brake binding (3.7.b.1) Nearside rear rear brake binding (3.7.b.1) 26 July 2013 [10:45] 26/07/2013 245627703260 245627703260
1 Offside rear brake recording little or no effort (3.7.b.5a) Offside rear brake recording little or no effort (3.7.b.5a) 26 July 2013 [10:45] 26/07/2013 245627703260 245627703260
1 Nearside front lower steering pivot point has excessive play (2.2.b.1g) Nearside front lower steering pivot point has excessive play (2.2.b.1g) 01 August 2012 [10:36] 01/08/2012 987254812299 987254812299
1 Brakes imbalanced across an axle (3.7.b.5b) Brakes imbalanced across an axle (3.7.b.5b) 02 August 2011 [16:13] 02/08/2011 968844011267 968844011267

ALL 452 3MV User Entered Faults [7]

ALL User Entered faults, ORDERED by OCCURRENCE DURING 452 3MV's MOT HISTORY
ALL 452 3MV User Entered Faults [7]
ALL User Entered faults, ORDERED by OCCURRENCE DURING 452 3MV's MOT HISTORY
User Entered Faults | source www.vehiclestats.co.uk
Fault Fault Test Date Test Date/Time Reference MOT Test Reference
2 No seat belts No seat belts 23 July 2014 [12:21] 23/07/2014 23 July 2014 [10:55] 23/07/2014 745474904284 745474904284 208744204209 208744204209
2 Slight play in o/s/f lower trunnion Slight play in o/s/f lower trunnion 23 July 2014 [12:21] 23/07/2014 23 July 2014 [10:55] 23/07/2014 745474904284 745474904284 208744204209 208744204209
2 Seat belts not fitted and not required before 1965 Seat belts not fitted and not required before 1965 31 July 2013 [11:49] 31/07/2013 26 July 2013 [10:45] 26/07/2013 305212313400 305212313400 245627703260 245627703260
1 Oil leak Oil leak 02 August 2011 [16:13] 02/08/2011 968844011267 968844011267

MOT TEST: 06 November 2018 10:21:51 PASSED
MOT TEST: 06 November 2018 10:21:51 PASSED

This test (667978017472) was completed on the 06 November 2018 10:21:51 and PASSED the requirements for a valid MOT with 0 comments.

This test (667978017472) was completed on the 06 November 2018 10:21:51 and PASSED the requirements for a valid MOT with 0 comments.

Recorded mileage: 1,881

Recorded mileage: 1,881


MOT TEST: 25 August 2017 13:39:40 PASSED
MOT TEST: 25 August 2017 13:39:40 PASSED

This test (642643568273) was completed on the 25 August 2017 13:39:40 and PASSED the requirements for a valid MOT with 1 comments.

This test (642643568273) was completed on the 25 August 2017 13:39:40 and PASSED the requirements for a valid MOT with 1 comments.

Recorded mileage: 1,781

Recorded mileage: 1,781


ADVISORY


MOT TEST: 25 August 2017 10:20:07 FAILED
MOT TEST: 25 August 2017 10:20:07 FAILED

This test (144792587250) was completed on the 25 August 2017 10:20:07 and FAILED the requirements for a valid MOT with 6 comments.

This test (144792587250) was completed on the 25 August 2017 10:20:07 and FAILED the requirements for a valid MOT with 6 comments.

Recorded mileage: 1,781

Recorded mileage: 1,781


ADVISORY

FAIL


MOT TEST: 04 August 2016 10:35:37 PASSED
MOT TEST: 04 August 2016 10:35:37 PASSED

This test (227831441781) was completed on the 04 August 2016 10:35:37 and PASSED the requirements for a valid MOT with 1 comments.

This test (227831441781) was completed on the 04 August 2016 10:35:37 and PASSED the requirements for a valid MOT with 1 comments.

Recorded mileage: 1,673

Recorded mileage: 1,673


ADVISORY


MOT TEST: 03 August 2016 14:10:37 FAILED
MOT TEST: 03 August 2016 14:10:37 FAILED

This test (300592564284) was completed on the 03 August 2016 14:10:37 and FAILED the requirements for a valid MOT with 3 comments.

This test (300592564284) was completed on the 03 August 2016 14:10:37 and FAILED the requirements for a valid MOT with 3 comments.

Recorded mileage: 1,673

Recorded mileage: 1,673


ADVISORY

FAIL


MOT TEST: 20 August 2015 14:50:04 PASSED
MOT TEST: 20 August 2015 14:50:04 PASSED

This test (794059635389) was completed on the 20 August 2015 14:50:04 and PASSED the requirements for a valid MOT with 1 comments.

This test (794059635389) was completed on the 20 August 2015 14:50:04 and PASSED the requirements for a valid MOT with 1 comments.

Recorded mileage: 1,567

Recorded mileage: 1,567


ADVISORY


MOT TEST: 20 August 2015 11:56:18 FAILED
MOT TEST: 20 August 2015 11:56:18 FAILED

This test (968476431404) was completed on the 20 August 2015 11:56:18 and FAILED the requirements for a valid MOT with 4 comments.

This test (968476431404) was completed on the 20 August 2015 11:56:18 and FAILED the requirements for a valid MOT with 4 comments.

Recorded mileage: 1,567

Recorded mileage: 1,567


ADVISORY

FAIL


MOT TEST: 23 July 2014 12:21:01 PASSED
MOT TEST: 23 July 2014 12:21:01 PASSED

This test (745474904284) was completed on the 23 July 2014 12:21:01 and PASSED the requirements for a valid MOT with 2 comments.

This test (745474904284) was completed on the 23 July 2014 12:21:01 and PASSED the requirements for a valid MOT with 2 comments.

Recorded mileage: 1,337

Recorded mileage: 1,337


USER ENTERED


MOT TEST: 23 July 2014 10:55:52 FAILED
MOT TEST: 23 July 2014 10:55:52 FAILED

This test (208744204209) was completed on the 23 July 2014 10:55:52 and FAILED the requirements for a valid MOT with 4 comments.

This test (208744204209) was completed on the 23 July 2014 10:55:52 and FAILED the requirements for a valid MOT with 4 comments.

Recorded mileage: 1,337

Recorded mileage: 1,337


FAIL

USER ENTERED


MOT TEST: 31 July 2013 11:49:33 PASSED
MOT TEST: 31 July 2013 11:49:33 PASSED

This test (305212313400) was completed on the 31 July 2013 11:49:33 and PASSED the requirements for a valid MOT with 1 comments.

This test (305212313400) was completed on the 31 July 2013 11:49:33 and PASSED the requirements for a valid MOT with 1 comments.

Recorded mileage: 1,222

Recorded mileage: 1,222


USER ENTERED


MOT TEST: 26 July 2013 10:45:09 FAILED
MOT TEST: 26 July 2013 10:45:09 FAILED

This test (245627703260) was completed on the 26 July 2013 10:45:09 and FAILED the requirements for a valid MOT with 5 comments.

This test (245627703260) was completed on the 26 July 2013 10:45:09 and FAILED the requirements for a valid MOT with 5 comments.

Recorded mileage: 1,222

Recorded mileage: 1,222


FAIL

USER ENTERED


MOT TEST: 08 August 2012 12:21:06 PASSED
MOT TEST: 08 August 2012 12:21:06 PASSED

This test (808741922201) was completed on the 08 August 2012 12:21:06 and PASSED the requirements for a valid MOT with 0 comments.

This test (808741922201) was completed on the 08 August 2012 12:21:06 and PASSED the requirements for a valid MOT with 0 comments.

Recorded mileage: 411

Recorded mileage: 411


MOT TEST: 01 August 2012 10:36:52 FAILED
MOT TEST: 01 August 2012 10:36:52 FAILED

This test (987254812299) was completed on the 01 August 2012 10:36:52 and FAILED the requirements for a valid MOT with 1 comments.

This test (987254812299) was completed on the 01 August 2012 10:36:52 and FAILED the requirements for a valid MOT with 1 comments.

Recorded mileage: 342

Recorded mileage: 342


FAIL


MOT TEST: 04 August 2011 11:10:48 PASSED
MOT TEST: 04 August 2011 11:10:48 PASSED

This test (155576111246) was completed on the 04 August 2011 11:10:48 and PASSED the requirements for a valid MOT with 0 comments.

This test (155576111246) was completed on the 04 August 2011 11:10:48 and PASSED the requirements for a valid MOT with 0 comments.

Recorded mileage: 47,339

Recorded mileage: 47,339


MOT TEST: 02 August 2011 16:13:27 FAILED
MOT TEST: 02 August 2011 16:13:27 FAILED

This test (968844011267) was completed on the 02 August 2011 16:13:27 and FAILED the requirements for a valid MOT with 3 comments.

This test (968844011267) was completed on the 02 August 2011 16:13:27 and FAILED the requirements for a valid MOT with 3 comments.

Recorded mileage: 47,323

Recorded mileage: 47,323


FAIL

USER ENTERED


MOT TEST: 30 July 2010 14:12:53 PASSED
MOT TEST: 30 July 2010 14:12:53 PASSED

This test (240031610221) was completed on the 30 July 2010 14:12:53 and PASSED the requirements for a valid MOT with 0 comments.

This test (240031610221) was completed on the 30 July 2010 14:12:53 and PASSED the requirements for a valid MOT with 0 comments.

Recorded mileage: 46,224

Recorded mileage: 46,224


MOT TEST: 10 August 2009 09:29:54 PASSED
MOT TEST: 10 August 2009 09:29:54 PASSED

This test (641402329221) was completed on the 10 August 2009 09:29:54 and PASSED the requirements for a valid MOT with 0 comments.

This test (641402329221) was completed on the 10 August 2009 09:29:54 and PASSED the requirements for a valid MOT with 0 comments.

Recorded mileage: 45,770

Recorded mileage: 45,770


MOT TEST: 11 August 2008 09:59:52 PASSED
MOT TEST: 11 August 2008 09:59:52 PASSED

This test (324164628284) was completed on the 11 August 2008 09:59:52 and PASSED the requirements for a valid MOT with 0 comments.

This test (324164628284) was completed on the 11 August 2008 09:59:52 and PASSED the requirements for a valid MOT with 0 comments.

Recorded mileage: 45,725

Recorded mileage: 45,725


MOT TEST: 14 September 2006 11:13:31 PASSED
MOT TEST: 14 September 2006 11:13:31 PASSED

This test (561407356276) was completed on the 14 September 2006 11:13:31 and PASSED the requirements for a valid MOT with 0 comments.

This test (561407356276) was completed on the 14 September 2006 11:13:31 and PASSED the requirements for a valid MOT with 0 comments.

Recorded mileage: 45,511

Recorded mileage: 45,511