452 CVE


452CVE is registered to a Grey 1963, Morris Minor with a Petrol engine. It Passed its most recent MOT Test on the 27 September 2018

8 unique faults (8 Total) reported in its MOT History (12 Tests).

0 common/recurring faults.

83% (10) MOT Pass Rate and a 17% (2) MOT Failure Rate.

65,547 recorded miles.

452 CVE


452CVE is registered to a Grey 1963, Morris Minor with a Petrol engine. It Passed its most recent MOT Test on the 27 September 2018

8 unique faults (8 Total) reported in its MOT History (12 Tests).

0 common/recurring faults.

83% (10) MOT Pass Rate and a 17% (2) MOT Failure Rate.

65,547 recorded miles.

MOT PASS/Failure rate for 452 CVE

all MOT test results for 452 CVE represented as a percentage
MOT PASS/Failure rate for 452 CVE
all MOT test results for 452 CVE represented as a percentage

PERCENTAGE OF VEHICLE FAULTS WITH 452 CVE

ALL REPORTED FAULTS, DISPLAYED BY PERCENTAGE OF OCCURRENCE DURING ALL MOT TESTS
PERCENTAGE OF VEHICLE FAULTS WITH 452 CVE
ALL REPORTED FAULTS, DISPLAYED BY PERCENTAGE OF OCCURRENCE DURING ALL MOT TESTS
FAIL

USER ENTERED

PASS WITH RECTIFICATION

452 CVE annual Faults by type

ALL REPORTED FAULTS, DISPLAYED over time and categorised by type
452 CVE annual Faults by type
ALL REPORTED FAULTS, DISPLAYED over time and categorised by type

ALL 452 CVE Failure Faults [6]

ALL Failure faults, ORDERED by OCCURRENCE DURING 452 CVE's MOT HISTORY
ALL 452 CVE Failure Faults [6]
ALL Failure faults, ORDERED by OCCURRENCE DURING 452 CVE's MOT HISTORY
Pass With Rectification Faults | source www.vehiclestats.co.uk
Fault Fault Test Date Test Date/Time Reference MOT Test Reference
1 Fuel system component leaking (7.2.3) Fuel system component leaking (7.2.3) 18 June 2009 [12:16] 18/06/2009 930629769199 930629769199
1 Nearside rear position lamp(s) excessively deteriorated so that it is not visible from a reasonable distance (1.1.a.3d) Nearside rear position lamp(s) excessively deteriorated so that it is not visible from a reasonable distance (1.1.a.3d) 06 September 2007 [13:56] 06/09/2007 332009147418 332009147418
1 Nearside front headlamp not working on main beam (1.7.5a) Nearside front headlamp not working on main beam (1.7.5a) 06 September 2007 [13:56] 06/09/2007 332009147418 332009147418
1 Offside front headlamp not working on main beam (1.7.5a) Offside front headlamp not working on main beam (1.7.5a) 06 September 2007 [13:56] 06/09/2007 332009147418 332009147418
1 Nearside front headlamp not working on dipped beam (1.7.5a) Nearside front headlamp not working on dipped beam (1.7.5a) 06 September 2007 [13:56] 06/09/2007 332009147418 332009147418
1 Offside front headlamp not working on dipped beam (1.7.5a) Offside front headlamp not working on dipped beam (1.7.5a) 06 September 2007 [13:56] 06/09/2007 332009147418 332009147418

ALL 452 CVE User Entered Faults [1]

ALL User Entered faults, ORDERED by OCCURRENCE DURING 452 CVE's MOT HISTORY
ALL 452 CVE User Entered Faults [1]
ALL User Entered faults, ORDERED by OCCURRENCE DURING 452 CVE's MOT HISTORY
User Entered Faults | source www.vehiclestats.co.uk
Fault Fault Test Date Test Date/Time Reference MOT Test Reference
1 N/s front outer steering rack gaiter becoming perished N/s front outer steering rack gaiter becoming perished 18 May 2011 [13:03] 18/05/2011 689448931174 689448931174

ALL 452 CVE Pass With Rectification Faults [1]

ALL Pass With Rectification faults, ORDERED by OCCURRENCE DURING 452 CVE's MOT HISTORY
ALL 452 CVE Pass With Rectification Faults [1]
ALL Pass With Rectification faults, ORDERED by OCCURRENCE DURING 452 CVE's MOT HISTORY
Pass With Rectification Faults | source www.vehiclestats.co.uk
Fault Fault Test Date Test Date/Time Reference MOT Test Reference
1 Front headlamp aim too low (1.8) Front headlamp aim too low (1.8) 18 June 2009 [12:16] 18/06/2009 930629769199 930629769199

MOT TEST: 27 September 2018 08:10:07 PASSED
MOT TEST: 27 September 2018 08:10:07 PASSED

This test (976630955697) was completed on the 27 September 2018 08:10:07 and PASSED the requirements for a valid MOT with 0 comments.

This test (976630955697) was completed on the 27 September 2018 08:10:07 and PASSED the requirements for a valid MOT with 0 comments.

Recorded mileage: 65,547

Recorded mileage: 65,547


MOT TEST: 17 July 2017 15:21:13 PASSED
MOT TEST: 17 July 2017 15:21:13 PASSED

This test (491800114615) was completed on the 17 July 2017 15:21:13 and PASSED the requirements for a valid MOT with 0 comments.

This test (491800114615) was completed on the 17 July 2017 15:21:13 and PASSED the requirements for a valid MOT with 0 comments.

Recorded mileage: 65,324

Recorded mileage: 65,324


MOT TEST: 11 July 2016 08:08:14 PASSED
MOT TEST: 11 July 2016 08:08:14 PASSED

This test (723945067502) was completed on the 11 July 2016 08:08:14 and PASSED the requirements for a valid MOT with 0 comments.

This test (723945067502) was completed on the 11 July 2016 08:08:14 and PASSED the requirements for a valid MOT with 0 comments.

Recorded mileage: 65,184

Recorded mileage: 65,184


MOT TEST: 21 May 2014 09:55:57 PASSED
MOT TEST: 21 May 2014 09:55:57 PASSED

This test (165361144155) was completed on the 21 May 2014 09:55:57 and PASSED the requirements for a valid MOT with 0 comments.

This test (165361144155) was completed on the 21 May 2014 09:55:57 and PASSED the requirements for a valid MOT with 0 comments.

Recorded mileage: 65,146

Recorded mileage: 65,146


MOT TEST: 31 May 2013 09:36:06 PASSED
MOT TEST: 31 May 2013 09:36:06 PASSED

This test (237661353424) was completed on the 31 May 2013 09:36:06 and PASSED the requirements for a valid MOT with 0 comments.

This test (237661353424) was completed on the 31 May 2013 09:36:06 and PASSED the requirements for a valid MOT with 0 comments.

Recorded mileage: 59,064

Recorded mileage: 59,064


MOT TEST: 28 May 2012 17:11:19 PASSED
MOT TEST: 28 May 2012 17:11:19 PASSED

This test (397589742158) was completed on the 28 May 2012 17:11:19 and PASSED the requirements for a valid MOT with 0 comments.

This test (397589742158) was completed on the 28 May 2012 17:11:19 and PASSED the requirements for a valid MOT with 0 comments.

Recorded mileage: 58,987

Recorded mileage: 58,987


MOT TEST: 18 May 2011 13:03:04 PASSED
MOT TEST: 18 May 2011 13:03:04 PASSED

This test (689448931174) was completed on the 18 May 2011 13:03:04 and PASSED the requirements for a valid MOT with 1 comments.

This test (689448931174) was completed on the 18 May 2011 13:03:04 and PASSED the requirements for a valid MOT with 1 comments.

Recorded mileage: 58,274

Recorded mileage: 58,274


USER ENTERED


MOT TEST: 18 June 2009 12:20:44 PASSED
MOT TEST: 18 June 2009 12:20:44 PASSED

This test (122949869170) was completed on the 18 June 2009 12:20:44 and PASSED the requirements for a valid MOT with 0 comments.

This test (122949869170) was completed on the 18 June 2009 12:20:44 and PASSED the requirements for a valid MOT with 0 comments.

Recorded mileage: 58,907

Recorded mileage: 58,907


MOT TEST: 18 June 2009 12:16:20 FAILED
MOT TEST: 18 June 2009 12:16:20 FAILED

This test (930629769199) was completed on the 18 June 2009 12:16:20 and FAILED the requirements for a valid MOT with 2 comments.

This test (930629769199) was completed on the 18 June 2009 12:16:20 and FAILED the requirements for a valid MOT with 2 comments.

Recorded mileage: 58,907

Recorded mileage: 58,907


FAIL

PASS WITH RECTIFICATION


MOT TEST: 07 September 2007 16:17:14 PASSED
MOT TEST: 07 September 2007 16:17:14 PASSED

This test (843150957260) was completed on the 07 September 2007 16:17:14 and PASSED the requirements for a valid MOT with 0 comments.

This test (843150957260) was completed on the 07 September 2007 16:17:14 and PASSED the requirements for a valid MOT with 0 comments.

Recorded mileage: 58,887

Recorded mileage: 58,887


MOT TEST: 06 September 2007 13:56:00 FAILED
MOT TEST: 06 September 2007 13:56:00 FAILED

This test (332009147418) was completed on the 06 September 2007 13:56:00 and FAILED the requirements for a valid MOT with 5 comments.

This test (332009147418) was completed on the 06 September 2007 13:56:00 and FAILED the requirements for a valid MOT with 5 comments.

Recorded mileage: 58,871

Recorded mileage: 58,871


FAIL


MOT TEST: 11 July 2006 11:08:52 PASSED
MOT TEST: 11 July 2006 11:08:52 PASSED

This test (521152496133) was completed on the 11 July 2006 11:08:52 and PASSED the requirements for a valid MOT with 0 comments.

This test (521152496133) was completed on the 11 July 2006 11:08:52 and PASSED the requirements for a valid MOT with 0 comments.

Recorded mileage: 58,068

Recorded mileage: 58,068