459 UXK


459UXK is registered to a Blue 1971, Morris Minor with a Petrol engine. It Failed its most recent MOT Test on the 16 June 2012

23 unique faults (31 Total) reported in its MOT History (8 Tests).

8 common/recurring faults, the most frequent (2 times) is: Nearside Torsion bar attachment bracket corroded but not seriously weakened (2.4.E.4c).

62% (5) MOT Pass Rate and a 38% (3) MOT Failure Rate.

18,511 recorded miles.

459 UXK


459UXK is registered to a Blue 1971, Morris Minor with a Petrol engine. It Failed its most recent MOT Test on the 16 June 2012

23 unique faults (31 Total) reported in its MOT History (8 Tests).

8 common/recurring faults, the most frequent (2 times) is: Nearside Torsion bar attachment bracket corroded but not seriously weakened (2.4.E.4c).

62% (5) MOT Pass Rate and a 38% (3) MOT Failure Rate.

18,511 recorded miles.

MOT PASS/Failure rate for 459 UXK

all MOT test results for 459 UXK represented as a percentage
MOT PASS/Failure rate for 459 UXK
all MOT test results for 459 UXK represented as a percentage

PERCENTAGE OF VEHICLE FAULTS WITH 459 UXK

ALL REPORTED FAULTS, DISPLAYED BY PERCENTAGE OF OCCURRENCE DURING ALL MOT TESTS
PERCENTAGE OF VEHICLE FAULTS WITH 459 UXK
ALL REPORTED FAULTS, DISPLAYED BY PERCENTAGE OF OCCURRENCE DURING ALL MOT TESTS
ADVISORY

FAIL

USER ENTERED

PASS WITH RECTIFICATION

459 UXK annual Faults by type

ALL REPORTED FAULTS, DISPLAYED over time and categorised by type
459 UXK annual Faults by type
ALL REPORTED FAULTS, DISPLAYED over time and categorised by type

RECURRING FAULTS WITH 459 UXK

FAULTS THAT HAVE OCCURED MORE THAN ONCE DURING 459 UXK's MOT HISTORY
RECURRING FAULTS WITH 459 UXK
FAULTS THAT HAVE OCCURED MORE THAN ONCE DURING 459 UXK's MOT HISTORY
Fault Fault Test Date Test Date/Time Reference MOT Test Reference
2 Nearside torsion bar attachment bracket corroded but not seriously weakened (2.4.e.4c) Nearside torsion bar attachment bracket corroded but not seriously weakened (2.4.e.4c) 16 June 2012 [11:13] 16/06/2012 02 June 2012 [09:14] 02/06/2012 118318162146 118318162146 246744552122 246744552122
2 Offside torsion bar attachment bracket corroded but not seriously weakened (2.4.e.4c) Offside torsion bar attachment bracket corroded but not seriously weakened (2.4.e.4c) 16 June 2012 [11:13] 16/06/2012 02 June 2012 [09:14] 02/06/2012 118318162146 118318162146 246744552122 246744552122
2 Offside rear leaf spring splayed but action not impaired (2.4.b.1c) Offside rear leaf spring splayed but action not impaired (2.4.b.1c) 16 June 2012 [11:13] 16/06/2012 02 June 2012 [09:14] 02/06/2012 118318162146 118318162146 246744552122 246744552122
2 Coolant leak Coolant leak 16 June 2012 [11:13] 16/06/2012 02 June 2012 [09:14] 02/06/2012 118318162146 118318162146 246744552122 246744552122
2 Oil leak Oil leak 16 June 2012 [11:13] 16/06/2012 02 June 2012 [09:14] 02/06/2012 118318162146 118318162146 246744552122 246744552122
2 Offside inner rear tyre worn close to the legal limit (4.1.e.1) Offside inner rear tyre worn close to the legal limit (4.1.e.1) 03 June 2011 [13:18] 03/06/2011 27 May 2011 [15:25] 27/05/2011 409814151197 409814151197 226707941464 226707941464
2 Near side outer front tyre wall starting to perrish and crack Near side outer front tyre wall starting to perrish and crack 03 June 2011 [13:18] 03/06/2011 27 May 2011 [15:25] 27/05/2011 409814151197 409814151197 226707941464 226707941464
2 Brake pedal travels near to floor but all brakes working ok Brake pedal travels near to floor but all brakes working ok 03 June 2011 [13:18] 03/06/2011 27 May 2011 [15:25] 27/05/2011 409814151197 409814151197 226707941464 226707941464

ALL 459 UXK ADVISORIES [9]

ALL ADVISORIES, ORDERED by OCCURRENCE DURING 459 UXK's MOT HISTORY
ALL 459 UXK ADVISORIES [9]
ALL ADVISORIES, ORDERED by OCCURRENCE DURING 459 UXK's MOT HISTORY
Advisory Faults | source www.vehiclestats.co.uk
Fault Fault Test Date Test Date/Time Reference MOT Test Reference
2 Nearside torsion bar attachment bracket corroded but not seriously weakened (2.4.e.4c) Nearside torsion bar attachment bracket corroded but not seriously weakened (2.4.e.4c) 16 June 2012 [11:13] 16/06/2012 02 June 2012 [09:14] 02/06/2012 118318162146 118318162146 246744552122 246744552122
2 Offside torsion bar attachment bracket corroded but not seriously weakened (2.4.e.4c) Offside torsion bar attachment bracket corroded but not seriously weakened (2.4.e.4c) 16 June 2012 [11:13] 16/06/2012 02 June 2012 [09:14] 02/06/2012 118318162146 118318162146 246744552122 246744552122
2 Offside rear leaf spring splayed but action not impaired (2.4.b.1c) Offside rear leaf spring splayed but action not impaired (2.4.b.1c) 16 June 2012 [11:13] 16/06/2012 02 June 2012 [09:14] 02/06/2012 118318162146 118318162146 246744552122 246744552122
2 Offside inner rear tyre worn close to the legal limit (4.1.e.1) Offside inner rear tyre worn close to the legal limit (4.1.e.1) 03 June 2011 [13:18] 03/06/2011 27 May 2011 [15:25] 27/05/2011 409814151197 409814151197 226707941464 226707941464
1 Nearside rear shock absorber has a slightly reduced damping effect (2.7.5) Nearside rear shock absorber has a slightly reduced damping effect (2.7.5) 02 June 2012 [09:14] 02/06/2012 246744552122 246744552122

ALL 459 UXK Failure Faults [7]

ALL Failure faults, ORDERED by OCCURRENCE DURING 459 UXK's MOT HISTORY
ALL 459 UXK Failure Faults [7]
ALL Failure faults, ORDERED by OCCURRENCE DURING 459 UXK's MOT HISTORY
Fail Faults | source www.vehiclestats.co.uk
Fault Fault Test Date Test Date/Time Reference MOT Test Reference
1 Offside headlamp not working on dipped beam (1.7.5a) Offside headlamp not working on dipped beam (1.7.5a) 02 June 2012 [09:14] 02/06/2012 246744552122 246744552122
1 Offside headlamp not working on main beam (1.7.5a) Offside headlamp not working on main beam (1.7.5a) 02 June 2012 [09:14] 02/06/2012 246744552122 246744552122
1 Offside rear shock absorber has negligible damping effect (2.7.5) Offside rear shock absorber has negligible damping effect (2.7.5) 02 June 2012 [09:14] 02/06/2012 246744552122 246744552122
1 Nearside outer front front suspension has excessive play in a upper suspension ball joint (2.5.b.1a) Nearside outer front front suspension has excessive play in a upper suspension ball joint (2.5.b.1a) 27 May 2011 [15:25] 27/05/2011 226707941464 226707941464
1 Offside inner rear suspension spring mounting prescribed area is excessively corroded (2.4.a.3) Offside inner rear suspension spring mounting prescribed area is excessively corroded (2.4.a.3) 27 May 2011 [15:25] 27/05/2011 226707941464 226707941464
1 Nearside inner rear suspension spring mounting prescribed area is excessively corroded (2.4.a.3) Nearside inner rear suspension spring mounting prescribed area is excessively corroded (2.4.a.3) 27 May 2011 [15:25] 27/05/2011 226707941464 226707941464
1 Nearside rear registration plate lamp not working (1.1.c.1d) Nearside rear registration plate lamp not working (1.1.c.1d) 27 May 2011 [15:25] 27/05/2011 226707941464 226707941464

ALL 459 UXK User Entered Faults [11]

ALL User Entered faults, ORDERED by OCCURRENCE DURING 459 UXK's MOT HISTORY
ALL 459 UXK User Entered Faults [11]
ALL User Entered faults, ORDERED by OCCURRENCE DURING 459 UXK's MOT HISTORY
Advisory Faults | source www.vehiclestats.co.uk
Fault Fault Test Date Test Date/Time Reference MOT Test Reference
2 Coolant leak Coolant leak 16 June 2012 [11:13] 16/06/2012 02 June 2012 [09:14] 02/06/2012 118318162146 118318162146 246744552122 246744552122
2 Oil leak Oil leak 16 June 2012 [11:13] 16/06/2012 02 June 2012 [09:14] 02/06/2012 118318162146 118318162146 246744552122 246744552122
2 Near side outer front tyre wall starting to perrish and crack Near side outer front tyre wall starting to perrish and crack 03 June 2011 [13:18] 03/06/2011 27 May 2011 [15:25] 27/05/2011 409814151197 409814151197 226707941464 226707941464
2 Brake pedal travels near to floor but all brakes working ok Brake pedal travels near to floor but all brakes working ok 03 June 2011 [13:18] 03/06/2011 27 May 2011 [15:25] 27/05/2011 409814151197 409814151197 226707941464 226707941464
1 Various corrosion to under body various repairs have been carried out previously Various corrosion to under body various repairs have been carried out previously 09 May 2006 [15:13] 09/05/2006 774479026114 774479026114
1 Washer system poor in operation Washer system poor in operation 09 May 2006 [15:13] 09/05/2006 774479026114 774479026114
1 Knock from steering column area when turning steering Knock from steering column area when turning steering 09 May 2006 [15:13] 09/05/2006 774479026114 774479026114

ALL 459 UXK Pass With Rectification Faults [4]

ALL Pass With Rectification faults, ORDERED by OCCURRENCE DURING 459 UXK's MOT HISTORY
ALL 459 UXK Pass With Rectification Faults [4]
ALL Pass With Rectification faults, ORDERED by OCCURRENCE DURING 459 UXK's MOT HISTORY
Pass With Rectification Faults | source www.vehiclestats.co.uk
Fault Fault Test Date Test Date/Time Reference MOT Test Reference
1 Offside front headlamp not working on dipped beam (1.7.5a) Offside front headlamp not working on dipped beam (1.7.5a) 28 May 2010 [14:36] 28/05/2010 464088540119 464088540119
1 Offside front headlamp not working on main beam (1.7.5a) Offside front headlamp not working on main beam (1.7.5a) 28 May 2010 [14:36] 28/05/2010 464088540119 464088540119
1 Nearside direction indicators not working (1.4.a.2c) Nearside direction indicators not working (1.4.a.2c) 28 May 2010 [14:36] 28/05/2010 464088540119 464088540119
1 Offside direction indicators not working (1.4.a.2c) Offside direction indicators not working (1.4.a.2c) 28 May 2010 [14:36] 28/05/2010 464088540119 464088540119

MOT TEST: 16 June 2012 11:13:28 PASSED
MOT TEST: 16 June 2012 11:13:28 PASSED

This test (118318162146) was completed on the 16 June 2012 11:13:28 and PASSED the requirements for a valid MOT with 5 comments.

This test (118318162146) was completed on the 16 June 2012 11:13:28 and PASSED the requirements for a valid MOT with 5 comments.

Recorded mileage: 18,511

Recorded mileage: 18,511


ADVISORY

USER ENTERED


MOT TEST: 02 June 2012 09:14:32 FAILED
MOT TEST: 02 June 2012 09:14:32 FAILED

This test (246744552122) was completed on the 02 June 2012 09:14:32 and FAILED the requirements for a valid MOT with 9 comments.

This test (246744552122) was completed on the 02 June 2012 09:14:32 and FAILED the requirements for a valid MOT with 9 comments.

Recorded mileage: 18,506

Recorded mileage: 18,506


ADVISORY

FAIL

USER ENTERED


MOT TEST: 03 June 2011 13:18:44 PASSED
MOT TEST: 03 June 2011 13:18:44 PASSED

This test (409814151197) was completed on the 03 June 2011 13:18:44 and PASSED the requirements for a valid MOT with 3 comments.

This test (409814151197) was completed on the 03 June 2011 13:18:44 and PASSED the requirements for a valid MOT with 3 comments.

Recorded mileage: 17,997

Recorded mileage: 17,997


ADVISORY

USER ENTERED


MOT TEST: 27 May 2011 15:25:49 FAILED
MOT TEST: 27 May 2011 15:25:49 FAILED

This test (226707941464) was completed on the 27 May 2011 15:25:49 and FAILED the requirements for a valid MOT with 7 comments.

This test (226707941464) was completed on the 27 May 2011 15:25:49 and FAILED the requirements for a valid MOT with 7 comments.

Recorded mileage: 17,996

Recorded mileage: 17,996


ADVISORY

FAIL

USER ENTERED


MOT TEST: 28 May 2010 14:36:58 FAILED
MOT TEST: 28 May 2010 14:36:58 FAILED

This test (464088540119) was completed on the 28 May 2010 14:36:58 and FAILED the requirements for a valid MOT with 4 comments.

This test (464088540119) was completed on the 28 May 2010 14:36:58 and FAILED the requirements for a valid MOT with 4 comments.

Recorded mileage: 17,531

Recorded mileage: 17,531


PASS WITH RECTIFICATION


MOT TEST: 28 May 2010 14:36:58 PASSED
MOT TEST: 28 May 2010 14:36:58 PASSED

This test (332658640111) was completed on the 28 May 2010 14:36:58 and PASSED the requirements for a valid MOT with 0 comments.

This test (332658640111) was completed on the 28 May 2010 14:36:58 and PASSED the requirements for a valid MOT with 0 comments.

Recorded mileage: 17,531

Recorded mileage: 17,531


MOT TEST: 15 May 2007 17:11:43 PASSED
MOT TEST: 15 May 2007 17:11:43 PASSED

This test (883805837129) was completed on the 15 May 2007 17:11:43 and PASSED the requirements for a valid MOT with 0 comments.

This test (883805837129) was completed on the 15 May 2007 17:11:43 and PASSED the requirements for a valid MOT with 0 comments.

Recorded mileage: 16,890

Recorded mileage: 16,890


MOT TEST: 09 May 2006 15:13:10 PASSED
MOT TEST: 09 May 2006 15:13:10 PASSED

This test (774479026114) was completed on the 09 May 2006 15:13:10 and PASSED the requirements for a valid MOT with 3 comments.

This test (774479026114) was completed on the 09 May 2006 15:13:10 and PASSED the requirements for a valid MOT with 3 comments.

Recorded mileage: 15,759

Recorded mileage: 15,759


USER ENTERED