46AVB


46AVB is registered to a Red 1963, Morris Traveler with a Petrol engine. It Failed its most recent MOT Test on the 14 August 2008

12 unique faults (14 Total) reported in its MOT History (3 Tests).

0 common/recurring faults.

67% (2) MOT Pass Rate and a 33% (1) MOT Failure Rate.

73,647 recorded miles.

46AVB


46AVB is registered to a Red 1963, Morris Traveler with a Petrol engine. It Failed its most recent MOT Test on the 14 August 2008

12 unique faults (14 Total) reported in its MOT History (3 Tests).

0 common/recurring faults.

67% (2) MOT Pass Rate and a 33% (1) MOT Failure Rate.

73,647 recorded miles.

MOT PASS/Failure rate for 46AVB

all MOT test results for 46AVB represented as a percentage
MOT PASS/Failure rate for 46AVB
all MOT test results for 46AVB represented as a percentage

PERCENTAGE OF VEHICLE FAULTS WITH 46AVB

ALL REPORTED FAULTS, DISPLAYED BY PERCENTAGE OF OCCURRENCE DURING ALL MOT TESTS
PERCENTAGE OF VEHICLE FAULTS WITH 46AVB
ALL REPORTED FAULTS, DISPLAYED BY PERCENTAGE OF OCCURRENCE DURING ALL MOT TESTS
FAIL

46AVB annual Faults by type

ALL REPORTED FAULTS, DISPLAYED over time and categorised by type
46AVB annual Faults by type
ALL REPORTED FAULTS, DISPLAYED over time and categorised by type

ALL 46AVB Failure Faults [14]

ALL Failure faults, ORDERED by OCCURRENCE DURING 46AVB's MOT HISTORY
ALL 46AVB Failure Faults [14]
ALL Failure faults, ORDERED by OCCURRENCE DURING 46AVB's MOT HISTORY
Fail Faults | source www.vehiclestats.co.uk
Fault Fault Test Date Test Date/Time Reference MOT Test Reference
1 Nearside windscreen wiper does not clear the windscreen effectively (8.2.2) Nearside windscreen wiper does not clear the windscreen effectively (8.2.2) 14 August 2008 [16:45] 14/08/2008 194227028232 194227028232
1 Offside windscreen wiper does not clear the windscreen effectively (8.2.2) Offside windscreen wiper does not clear the windscreen effectively (8.2.2) 14 August 2008 [16:45] 14/08/2008 194227028232 194227028232
1 Front passenger door cannot be opened from outside the vehicle (6.2.b.1b) Front passenger door cannot be opened from outside the vehicle (6.2.b.1b) 14 August 2008 [16:45] 14/08/2008 194227028232 194227028232
1 Nearside stop lamp not working (1.2.1b) Nearside stop lamp not working (1.2.1b) 14 August 2008 [16:45] 14/08/2008 194227028232 194227028232
1 Offside stop lamp not working (1.2.1b) Offside stop lamp not working (1.2.1b) 14 August 2008 [16:45] 14/08/2008 194227028232 194227028232
1 Nearside headlamp aim too high (1.8) Nearside headlamp aim too high (1.8) 14 August 2008 [16:45] 14/08/2008 194227028232 194227028232
1 Exhaust has a major leak of exhaust gases (7.1.2) Exhaust has a major leak of exhaust gases (7.1.2) 14 August 2008 [16:45] 14/08/2008 194227028232 194227028232
1 Nearside front tie bar/rod attachment bracket/mounting corroded and its strength is seriously reduced (2.4.g.1) Nearside front tie bar/rod attachment bracket/mounting corroded and its strength is seriously reduced (2.4.g.1) 14 August 2008 [16:45] 14/08/2008 194227028232 194227028232
1 Offside front tie bar/rod attachment bracket/mounting corroded and its strength is seriously reduced (2.4.g.1) Offside front tie bar/rod attachment bracket/mounting corroded and its strength is seriously reduced (2.4.g.1) 14 August 2008 [16:45] 14/08/2008 194227028232 194227028232
1 Nearside rear suspension spring mounting prescribed area is excessively corroded (2.4.a.3) Nearside rear suspension spring mounting prescribed area is excessively corroded (2.4.a.3) 14 August 2008 [16:45] 14/08/2008 194227028232 194227028232
1 Offside rear suspension spring mounting prescribed area is excessively corroded (2.4.a.3) Offside rear suspension spring mounting prescribed area is excessively corroded (2.4.a.3) 14 August 2008 [16:45] 14/08/2008 194227028232 194227028232
1 Parking brake: efficiency below requirements (3.7.b.7) Parking brake: efficiency below requirements (3.7.b.7) 14 August 2008 [16:45] 14/08/2008 194227028232 194227028232

MOT TEST: 14 August 2008 16:45:02 FAILED
MOT TEST: 14 August 2008 16:45:02 FAILED

This test (194227028232) was completed on the 14 August 2008 16:45:02 and FAILED the requirements for a valid MOT with 14 comments.

This test (194227028232) was completed on the 14 August 2008 16:45:02 and FAILED the requirements for a valid MOT with 14 comments.

Recorded mileage: 73,647

Recorded mileage: 73,647


FAIL


MOT TEST: 10 August 2007 12:44:43 PASSED
MOT TEST: 10 August 2007 12:44:43 PASSED

This test (892662427286) was completed on the 10 August 2007 12:44:43 and PASSED the requirements for a valid MOT with 0 comments.

This test (892662427286) was completed on the 10 August 2007 12:44:43 and PASSED the requirements for a valid MOT with 0 comments.

Recorded mileage: 71,008

Recorded mileage: 71,008


MOT TEST: 07 August 2006 16:40:26 PASSED
MOT TEST: 07 August 2006 16:40:26 PASSED

This test (904019016260) was completed on the 07 August 2006 16:40:26 and PASSED the requirements for a valid MOT with 0 comments.

This test (904019016260) was completed on the 07 August 2006 16:40:26 and PASSED the requirements for a valid MOT with 0 comments.

Recorded mileage: 67,890

Recorded mileage: 67,890