471 UXO


471UXO is registered to a Green 1971, Morris Minor 1000 with a Petrol engine. It Failed its most recent MOT Test on the 30 June 2017

14 unique faults (14 Total) reported in its MOT History (10 Tests).

0 common/recurring faults.

80% (8) MOT Pass Rate and a 20% (2) MOT Failure Rate.

19,110 recorded miles.

471 UXO


471UXO is registered to a Green 1971, Morris Minor 1000 with a Petrol engine. It Failed its most recent MOT Test on the 30 June 2017

14 unique faults (14 Total) reported in its MOT History (10 Tests).

0 common/recurring faults.

80% (8) MOT Pass Rate and a 20% (2) MOT Failure Rate.

19,110 recorded miles.

MOT PASS/Failure rate for 471 UXO

all MOT test results for 471 UXO represented as a percentage
MOT PASS/Failure rate for 471 UXO
all MOT test results for 471 UXO represented as a percentage

PERCENTAGE OF VEHICLE FAULTS WITH 471 UXO

ALL REPORTED FAULTS, DISPLAYED BY PERCENTAGE OF OCCURRENCE DURING ALL MOT TESTS
PERCENTAGE OF VEHICLE FAULTS WITH 471 UXO
ALL REPORTED FAULTS, DISPLAYED BY PERCENTAGE OF OCCURRENCE DURING ALL MOT TESTS
ADVISORY

FAIL

471 UXO annual Faults by type

ALL REPORTED FAULTS, DISPLAYED over time and categorised by type
471 UXO annual Faults by type
ALL REPORTED FAULTS, DISPLAYED over time and categorised by type

ALL 471 UXO ADVISORIES [4]

ALL ADVISORIES, ORDERED by OCCURRENCE DURING 471 UXO's MOT HISTORY
ALL 471 UXO ADVISORIES [4]
ALL ADVISORIES, ORDERED by OCCURRENCE DURING 471 UXO's MOT HISTORY
Advisory Faults | source www.vehiclestats.co.uk
Fault Fault Test Date Test Date/Time Reference MOT Test Reference
1 Offside front steering rack gaiter deteriorated (2.2.d.2d) Offside front steering rack gaiter deteriorated (2.2.d.2d) 27 June 2016 [09:12] 27/06/2016 856924682617 856924682617
1 Offside front front wheel bearing has slight play slight noise (2.5.a.3c) Offside front front wheel bearing has slight play slight noise (2.5.a.3c) 27 June 2016 [09:12] 27/06/2016 856924682617 856924682617
1 Offside front front brake fluctuating, but not excessively (3.7.b.3) Offside front front brake fluctuating, but not excessively (3.7.b.3) 27 June 2016 [09:12] 27/06/2016 856924682617 856924682617
1 Steering column top bearing slightly worn (2.1.2c) Steering column top bearing slightly worn (2.1.2c) 27 June 2016 [09:12] 27/06/2016 856924682617 856924682617

ALL 471 UXO Failure Faults [10]

ALL Failure faults, ORDERED by OCCURRENCE DURING 471 UXO's MOT HISTORY
ALL 471 UXO Failure Faults [10]
ALL Failure faults, ORDERED by OCCURRENCE DURING 471 UXO's MOT HISTORY
Fail Faults | source www.vehiclestats.co.uk
Fault Fault Test Date Test Date/Time Reference MOT Test Reference
1 Front brakes imbalanced across an axle (3.7.b.5b) Front brakes imbalanced across an axle (3.7.b.5b) 10 June 2015 [11:37] 10/06/2015 846671865117 846671865117
1 Rear brakes imbalanced across an axle (3.7.b.5b) Rear brakes imbalanced across an axle (3.7.b.5b) 10 June 2015 [11:37] 10/06/2015 846671865117 846671865117
1 Nearside windscreen wiper does not clear the windscreen effectively (8.2.2) Nearside windscreen wiper does not clear the windscreen effectively (8.2.2) 10 June 2015 [11:37] 10/06/2015 846671865117 846671865117
1 Service brake: efficiency below requirements (3.7.b.7) Service brake: efficiency below requirements (3.7.b.7) 10 June 2015 [11:37] 10/06/2015 846671865117 846671865117
1 Brakes imbalanced across an axle (3.7.b.5b) Brakes imbalanced across an axle (3.7.b.5b) 10 June 2015 [11:37] 10/06/2015 846671865117 846671865117
1 Horn not working (1.6.2a) Horn not working (1.6.2a) 01 May 2009 [13:04] 01/05/2009 553051729184 553051729184
1 Nearside headlamp not working on dipped beam (1.7.5a) Nearside headlamp not working on dipped beam (1.7.5a) 01 May 2009 [13:04] 01/05/2009 553051729184 553051729184
1 Nearside headlamp not working on main beam (1.7.5a) Nearside headlamp not working on main beam (1.7.5a) 01 May 2009 [13:04] 01/05/2009 553051729184 553051729184
1 Nearside front suspension arm insecure (2.4.g.1) Nearside front suspension arm insecure (2.4.g.1) 01 May 2009 [13:04] 01/05/2009 553051729184 553051729184
1 Drivers seat insecure (6.2.a.1) Drivers seat insecure (6.2.a.1) 01 May 2009 [13:04] 01/05/2009 553051729184 553051729184

MOT TEST: 30 June 2017 15:08:48 PASSED
MOT TEST: 30 June 2017 15:08:48 PASSED

This test (419805022605) was completed on the 30 June 2017 15:08:48 and PASSED the requirements for a valid MOT with 0 comments.

This test (419805022605) was completed on the 30 June 2017 15:08:48 and PASSED the requirements for a valid MOT with 0 comments.

Recorded mileage: 19,110

Recorded mileage: 19,110


MOT TEST: 27 June 2016 09:12:50 PASSED
MOT TEST: 27 June 2016 09:12:50 PASSED

This test (856924682617) was completed on the 27 June 2016 09:12:50 and PASSED the requirements for a valid MOT with 4 comments.

This test (856924682617) was completed on the 27 June 2016 09:12:50 and PASSED the requirements for a valid MOT with 4 comments.

Recorded mileage: 18,757

Recorded mileage: 18,757


ADVISORY


MOT TEST: 29 June 2015 15:28:57 PASSED
MOT TEST: 29 June 2015 15:28:57 PASSED

This test (636300385147) was completed on the 29 June 2015 15:28:57 and PASSED the requirements for a valid MOT with 0 comments.

This test (636300385147) was completed on the 29 June 2015 15:28:57 and PASSED the requirements for a valid MOT with 0 comments.

Recorded mileage: 18,401

Recorded mileage: 18,401


MOT TEST: 10 June 2015 11:37:29 FAILED
MOT TEST: 10 June 2015 11:37:29 FAILED

This test (846671865117) was completed on the 10 June 2015 11:37:29 and FAILED the requirements for a valid MOT with 5 comments.

This test (846671865117) was completed on the 10 June 2015 11:37:29 and FAILED the requirements for a valid MOT with 5 comments.

Recorded mileage: 18,397

Recorded mileage: 18,397


FAIL


MOT TEST: 11 March 2014 08:59:22 PASSED
MOT TEST: 11 March 2014 08:59:22 PASSED

This test (407700874005) was completed on the 11 March 2014 08:59:22 and PASSED the requirements for a valid MOT with 0 comments.

This test (407700874005) was completed on the 11 March 2014 08:59:22 and PASSED the requirements for a valid MOT with 0 comments.

Recorded mileage: 18,107

Recorded mileage: 18,107


MOT TEST: 28 February 2013 14:48:04 PASSED
MOT TEST: 28 February 2013 14:48:04 PASSED

This test (119149053445) was completed on the 28 February 2013 14:48:04 and PASSED the requirements for a valid MOT with 0 comments.

This test (119149053445) was completed on the 28 February 2013 14:48:04 and PASSED the requirements for a valid MOT with 0 comments.

Recorded mileage: 17,799

Recorded mileage: 17,799


MOT TEST: 18 February 2012 09:55:57 PASSED
MOT TEST: 18 February 2012 09:55:57 PASSED

This test (327199342099) was completed on the 18 February 2012 09:55:57 and PASSED the requirements for a valid MOT with 0 comments.

This test (327199342099) was completed on the 18 February 2012 09:55:57 and PASSED the requirements for a valid MOT with 0 comments.

Recorded mileage: 4,144

Recorded mileage: 4,144


MOT TEST: 23 February 2011 17:41:43 PASSED
MOT TEST: 23 February 2011 17:41:43 PASSED

This test (389654351060) was completed on the 23 February 2011 17:41:43 and PASSED the requirements for a valid MOT with 0 comments.

This test (389654351060) was completed on the 23 February 2011 17:41:43 and PASSED the requirements for a valid MOT with 0 comments.

Recorded mileage: 11,521

Recorded mileage: 11,521


MOT TEST: 21 May 2009 08:58:52 PASSED
MOT TEST: 21 May 2009 08:58:52 PASSED

This test (133511649111) was completed on the 21 May 2009 08:58:52 and PASSED the requirements for a valid MOT with 0 comments.

This test (133511649111) was completed on the 21 May 2009 08:58:52 and PASSED the requirements for a valid MOT with 0 comments.

Recorded mileage: 11,502

Recorded mileage: 11,502


MOT TEST: 01 May 2009 13:04:33 FAILED
MOT TEST: 01 May 2009 13:04:33 FAILED

This test (553051729184) was completed on the 01 May 2009 13:04:33 and FAILED the requirements for a valid MOT with 5 comments.

This test (553051729184) was completed on the 01 May 2009 13:04:33 and FAILED the requirements for a valid MOT with 5 comments.

Recorded mileage: 11,497

Recorded mileage: 11,497


FAIL