472 PKX


472PKX is registered to a Black 1960, Morris Minor with a Petrol engine. It Passed its most recent MOT Test on the 18 December 2018

69 unique faults (88 Total) reported in its MOT History (17 Tests).

19 common/recurring faults, the most frequent (2 times) is: Parking brake: efficiency below requirements (3.7.B.7).

53% (9) MOT Pass Rate and a 47% (8) MOT Failure Rate.

79,279 recorded miles.

472 PKX


472PKX is registered to a Black 1960, Morris Minor with a Petrol engine. It Passed its most recent MOT Test on the 18 December 2018

69 unique faults (88 Total) reported in its MOT History (17 Tests).

19 common/recurring faults, the most frequent (2 times) is: Parking brake: efficiency below requirements (3.7.B.7).

53% (9) MOT Pass Rate and a 47% (8) MOT Failure Rate.

79,279 recorded miles.

MOT PASS/Failure rate for 472 PKX

all MOT test results for 472 PKX represented as a percentage
MOT PASS/Failure rate for 472 PKX
all MOT test results for 472 PKX represented as a percentage

PERCENTAGE OF VEHICLE FAULTS WITH 472 PKX

ALL REPORTED FAULTS, DISPLAYED BY PERCENTAGE OF OCCURRENCE DURING ALL MOT TESTS
PERCENTAGE OF VEHICLE FAULTS WITH 472 PKX
ALL REPORTED FAULTS, DISPLAYED BY PERCENTAGE OF OCCURRENCE DURING ALL MOT TESTS
ADVISORY

FAIL

USER ENTERED

PASS WITH RECTIFICATION

472 PKX annual Faults by type

ALL REPORTED FAULTS, DISPLAYED over time and categorised by type
472 PKX annual Faults by type
ALL REPORTED FAULTS, DISPLAYED over time and categorised by type

RECURRING FAULTS WITH 472 PKX

FAULTS THAT HAVE OCCURED MORE THAN ONCE DURING 472 PKX's MOT HISTORY
RECURRING FAULTS WITH 472 PKX
FAULTS THAT HAVE OCCURED MORE THAN ONCE DURING 472 PKX's MOT HISTORY
Fault Fault Test Date Test Date/Time Reference MOT Test Reference
2 Parking brake: efficiency below requirements (3.7.b.7) Parking brake: efficiency below requirements (3.7.b.7) 21 December 2017 [10:25] 21/12/2017 08 December 2011 [10:08] 08/12/2011 806913876545 806913876545 435062841470 435062841470
2 Nearside rear body has slight corrosion floor by the seat (6.1.b.2) Nearside rear body has slight corrosion floor by the seat (6.1.b.2) 10 January 2017 [09:29] 10/01/2017 10 January 2017 [09:29] 10/01/2017 438983099801 438983099801 355947896491 355947896491
2 Nearside front tie bar/rod has slight play in a pin/bush (2.4.g.2) Nearside front tie bar/rod has slight play in a pin/bush (2.4.g.2) 10 January 2017 [09:29] 10/01/2017 10 January 2017 [09:29] 10/01/2017 438983099801 438983099801 355947896491 355947896491
2 Offside front tie bar/rod rubber bush deteriorated but not resulting in excessive movement (2.4.g.2) Offside front tie bar/rod rubber bush deteriorated but not resulting in excessive movement (2.4.g.2) 10 January 2017 [09:29] 10/01/2017 10 January 2017 [09:29] 10/01/2017 438983099801 438983099801 355947896491 355947896491
2 Front windscreen washer provides insufficient washer liquid (8.2.3) Front windscreen washer provides insufficient washer liquid (8.2.3) 10 January 2017 [09:29] 10/01/2017 08 December 2011 [10:08] 08/12/2011 355947896491 355947896491 435062841470 435062841470
2 Offside rear tyre starting to crack Offside rear tyre starting to crack 27 January 2016 [16:45] 27/01/2016 27 January 2016 [14:41] 27/01/2016 451640850346 451640850346 761464964191 761464964191
2 Fuel tank leaking (7.2.3) Fuel tank leaking (7.2.3) 22 December 2014 [09:35] 22/12/2014 09 December 2010 [13:19] 09/12/2010 616786154378 616786154378 180603040370 180603040370
2 Offside rear stop lamp not working (1.2.1b) Offside rear stop lamp not working (1.2.1b) 22 December 2014 [09:35] 22/12/2014 03 January 2013 [11:02] 03/01/2013 616786154378 616786154378 937343303041 937343303041
2 Nearside rear parking brake recording little or no effort (3.7.b.6a) Nearside rear parking brake recording little or no effort (3.7.b.6a) 22 December 2014 [09:35] 22/12/2014 08 December 2011 [10:08] 08/12/2011 616786154378 616786154378 435062841470 435062841470
2 Windscreen washer provides insufficient washer liquid (8.2.3) Windscreen washer provides insufficient washer liquid (8.2.3) 19 December 2013 [12:33] 19/12/2013 03 January 2013 [11:02] 03/01/2013 657023353316 657023353316 937343303041 937343303041
2 Exhaust has a major leak of exhaust gases (7.1.2) Exhaust has a major leak of exhaust gases (7.1.2) 19 December 2013 [12:33] 19/12/2013 09 December 2010 [13:19] 09/12/2010 657023353316 657023353316 180603040370 180603040370
2 Nearside front front wheel bearing has slight play (2.5.a.3c) Nearside front front wheel bearing has slight play (2.5.a.3c) 04 January 2013 [17:00] 04/01/2013 03 January 2013 [11:02] 03/01/2013 158424403096 158424403096 937343303041 937343303041
2 Offside front front wheel bearing has slight play (2.5.a.3c) Offside front front wheel bearing has slight play (2.5.a.3c) 04 January 2013 [17:00] 04/01/2013 03 January 2013 [11:02] 03/01/2013 158424403096 158424403096 937343303041 937343303041
2 Offside front upper suspension component mounting prescribed area is corroded but not considered excessive (2.4.a.3) Offside front upper suspension component mounting prescribed area is corroded but not considered excessive (2.4.a.3) 20 December 2011 [14:28] 20/12/2011 08 December 2011 [10:08] 08/12/2011 478884351422 478884351422 435062841470 435062841470
2 Rear shock absorber has a slightly reduced damping effect (2.7.5) Rear shock absorber has a slightly reduced damping effect (2.7.5) 20 December 2011 [14:28] 20/12/2011 08 December 2011 [10:08] 08/12/2011 478884351422 478884351422 435062841470 435062841470
2 Rear bumpstops and rear chassis starting to rust Rear bumpstops and rear chassis starting to rust 20 December 2011 [14:28] 20/12/2011 08 December 2011 [10:08] 08/12/2011 478884351422 478884351422 435062841470 435062841470
2 Brake pedal anti-slip provision missing (3.3.a.1b) Brake pedal anti-slip provision missing (3.3.a.1b) 08 December 2011 [10:08] 08/12/2011 09 December 2010 [13:19] 09/12/2010 435062841470 435062841470 180603040370 180603040370
2 Nearside headlamp aim too high (1.8) Nearside headlamp aim too high (1.8) 08 December 2011 [10:08] 08/12/2011 09 December 2010 [13:19] 09/12/2010 435062841470 435062841470 180603040370 180603040370
2 Nearside rear brake recording little or no effort (3.7.b.5a) Nearside rear brake recording little or no effort (3.7.b.5a) 08 December 2011 [10:08] 08/12/2011 09 December 2010 [13:19] 09/12/2010 435062841470 435062841470 180603040370 180603040370

ALL 472 PKX ADVISORIES [22]

ALL ADVISORIES, ORDERED by OCCURRENCE DURING 472 PKX's MOT HISTORY
ALL 472 PKX ADVISORIES [22]
ALL ADVISORIES, ORDERED by OCCURRENCE DURING 472 PKX's MOT HISTORY
Advisory Faults | source www.vehiclestats.co.uk
Fault Fault Test Date Test Date/Time Reference MOT Test Reference
2 Nearside rear body has slight corrosion floor by the seat (6.1.b.2) Nearside rear body has slight corrosion floor by the seat (6.1.b.2) 10 January 2017 [09:29] 10/01/2017 10 January 2017 [09:29] 10/01/2017 438983099801 438983099801 355947896491 355947896491
2 Nearside front tie bar/rod has slight play in a pin/bush (2.4.g.2) Nearside front tie bar/rod has slight play in a pin/bush (2.4.g.2) 10 January 2017 [09:29] 10/01/2017 10 January 2017 [09:29] 10/01/2017 438983099801 438983099801 355947896491 355947896491
2 Offside front tie bar/rod rubber bush deteriorated but not resulting in excessive movement (2.4.g.2) Offside front tie bar/rod rubber bush deteriorated but not resulting in excessive movement (2.4.g.2) 10 January 2017 [09:29] 10/01/2017 10 January 2017 [09:29] 10/01/2017 438983099801 438983099801 355947896491 355947896491
2 Offside rear tyre starting to crack Offside rear tyre starting to crack 27 January 2016 [16:45] 27/01/2016 27 January 2016 [14:41] 27/01/2016 451640850346 451640850346 761464964191 761464964191
2 Nearside front front wheel bearing has slight play (2.5.a.3c) Nearside front front wheel bearing has slight play (2.5.a.3c) 04 January 2013 [17:00] 04/01/2013 03 January 2013 [11:02] 03/01/2013 158424403096 158424403096 937343303041 937343303041
2 Offside front front wheel bearing has slight play (2.5.a.3c) Offside front front wheel bearing has slight play (2.5.a.3c) 04 January 2013 [17:00] 04/01/2013 03 January 2013 [11:02] 03/01/2013 158424403096 158424403096 937343303041 937343303041
2 Offside front upper suspension component mounting prescribed area is corroded but not considered excessive (2.4.a.3) Offside front upper suspension component mounting prescribed area is corroded but not considered excessive (2.4.a.3) 20 December 2011 [14:28] 20/12/2011 08 December 2011 [10:08] 08/12/2011 478884351422 478884351422 435062841470 435062841470
2 Rear shock absorber has a slightly reduced damping effect (2.7.5) Rear shock absorber has a slightly reduced damping effect (2.7.5) 20 December 2011 [14:28] 20/12/2011 08 December 2011 [10:08] 08/12/2011 478884351422 478884351422 435062841470 435062841470
1 Nearside front wheel bearing has slight play (2.5.a.3c) Nearside front wheel bearing has slight play (2.5.a.3c) 22 December 2014 [09:35] 22/12/2014 616786154378 616786154378
1 Offside front wheel bearing has slight play (2.5.a.3c) Offside front wheel bearing has slight play (2.5.a.3c) 22 December 2014 [09:35] 22/12/2014 616786154378 616786154378
1 Offside rear tyre worn close to the legal limit (4.1.e.1) Offside rear tyre worn close to the legal limit (4.1.e.1) 22 December 2014 [09:35] 22/12/2014 616786154378 616786154378
1 Rear shock absorber has a light misting of oil (2.7.3) Rear shock absorber has a light misting of oil (2.7.3) 08 December 2011 [10:08] 08/12/2011 435062841470 435062841470
1 Nearside rear tyre worn close to the legal limit (4.1.e.1) Nearside rear tyre worn close to the legal limit (4.1.e.1) 08 December 2011 [10:08] 08/12/2011 435062841470 435062841470
1 Offside rear road wheel with a slightly distorted bead rim (4.2.a.1a) Offside rear road wheel with a slightly distorted bead rim (4.2.a.1a) 09 December 2010 [13:19] 09/12/2010 180603040370 180603040370

ALL 472 PKX Failure Faults [51]

ALL Failure faults, ORDERED by OCCURRENCE DURING 472 PKX's MOT HISTORY
ALL 472 PKX Failure Faults [51]
ALL Failure faults, ORDERED by OCCURRENCE DURING 472 PKX's MOT HISTORY
Fail Faults | source www.vehiclestats.co.uk
Fault Fault Test Date Test Date/Time Reference MOT Test Reference
2 Parking brake: efficiency below requirements (3.7.b.7) Parking brake: efficiency below requirements (3.7.b.7) 21 December 2017 [10:25] 21/12/2017 08 December 2011 [10:08] 08/12/2011 806913876545 806913876545 435062841470 435062841470
2 Fuel tank leaking (7.2.3) Fuel tank leaking (7.2.3) 22 December 2014 [09:35] 22/12/2014 09 December 2010 [13:19] 09/12/2010 616786154378 616786154378 180603040370 180603040370
2 Offside rear stop lamp not working (1.2.1b) Offside rear stop lamp not working (1.2.1b) 22 December 2014 [09:35] 22/12/2014 03 January 2013 [11:02] 03/01/2013 616786154378 616786154378 937343303041 937343303041
2 Nearside rear parking brake recording little or no effort (3.7.b.6a) Nearside rear parking brake recording little or no effort (3.7.b.6a) 22 December 2014 [09:35] 22/12/2014 08 December 2011 [10:08] 08/12/2011 616786154378 616786154378 435062841470 435062841470
2 Brake pedal anti-slip provision missing (3.3.a.1b) Brake pedal anti-slip provision missing (3.3.a.1b) 08 December 2011 [10:08] 08/12/2011 09 December 2010 [13:19] 09/12/2010 435062841470 435062841470 180603040370 180603040370
2 Nearside headlamp aim too high (1.8) Nearside headlamp aim too high (1.8) 08 December 2011 [10:08] 08/12/2011 09 December 2010 [13:19] 09/12/2010 435062841470 435062841470 180603040370 180603040370
2 Nearside rear brake recording little or no effort (3.7.b.5a) Nearside rear brake recording little or no effort (3.7.b.5a) 08 December 2011 [10:08] 08/12/2011 09 December 2010 [13:19] 09/12/2010 435062841470 435062841470 180603040370 180603040370
1 Central front windscreen washer provides insufficient washer liquid (8.2.3) Central front windscreen washer provides insufficient washer liquid (8.2.3) 21 December 2017 [10:25] 21/12/2017 806913876545 806913876545
1 Rear parking brake lever has no reserve travel (3.1.6b) Rear parking brake lever has no reserve travel (3.1.6b) 21 December 2017 [10:25] 21/12/2017 806913876545 806913876545
1 Nearside rear body or chassis has excessive corrosion, seriously affecting its strength within 30cm of the body mountings floor by rear spring hanger (6.1.b.2) Nearside rear body or chassis has excessive corrosion, seriously affecting its strength within 30cm of the body mountings floor by rear spring hanger (6.1.b.2) 21 December 2017 [10:25] 21/12/2017 806913876545 806913876545
1 Nearside front inner body or chassis has excessive corrosion, seriously affecting its strength within 30cm of the body mountings floor (6.1.b.2) Nearside front inner body or chassis has excessive corrosion, seriously affecting its strength within 30cm of the body mountings floor (6.1.b.2) 21 December 2017 [10:25] 21/12/2017 806913876545 806913876545
1 Offside front inner body or chassis has excessive corrosion, seriously affecting its strength within 30cm of the body mountings floor (6.1.b.2) Offside front inner body or chassis has excessive corrosion, seriously affecting its strength within 30cm of the body mountings floor (6.1.b.2) 21 December 2017 [10:25] 21/12/2017 806913876545 806913876545
1 Nearside rear inner tyre has a bulge, caused by separation or partial failure of its structure (4.1.d.1b) Nearside rear inner tyre has a bulge, caused by separation or partial failure of its structure (4.1.d.1b) 21 December 2017 [10:25] 21/12/2017 806913876545 806913876545
1 Offside rear inner tyre has a bulge, caused by separation or partial failure of its structure (4.1.d.1b) Offside rear inner tyre has a bulge, caused by separation or partial failure of its structure (4.1.d.1b) 21 December 2017 [10:25] 21/12/2017 806913876545 806913876545
1 Nearside front inner tyre has a bulge, caused by separation or partial failure of its structure (4.1.d.1b) Nearside front inner tyre has a bulge, caused by separation or partial failure of its structure (4.1.d.1b) 21 December 2017 [10:25] 21/12/2017 806913876545 806913876545
1 Centre front windscreen washer provides insufficient washer liquid (8.2.3) Centre front windscreen washer provides insufficient washer liquid (8.2.3) 27 January 2016 [14:41] 27/01/2016 761464964191 761464964191
1 Offside rear vehicle structure has an unsatisfactory modification, seriously affecting its strength within 30cm of the body mountings (6.1.b.2) Offside rear vehicle structure has an unsatisfactory modification, seriously affecting its strength within 30cm of the body mountings (6.1.b.2) 27 January 2016 [14:41] 27/01/2016 761464964191 761464964191
1 Nearside rear stop lamp not working (1.2.1b) Nearside rear stop lamp not working (1.2.1b) 22 December 2014 [09:35] 22/12/2014 616786154378 616786154378
1 Exhaust system not adequately supported (7.1.1) Exhaust system not adequately supported (7.1.1) 22 December 2014 [09:35] 22/12/2014 616786154378 616786154378
1 Offside front headlamp not working on dipped beam (1.7.5a) Offside front headlamp not working on dipped beam (1.7.5a) 03 January 2013 [11:02] 03/01/2013 937343303041 937343303041
1 Windscreen washer provides insufficient washer liquid (8.2.3) Windscreen washer provides insufficient washer liquid (8.2.3) 03 January 2013 [11:02] 03/01/2013 937343303041 937343303041
1 Offside front front brake recording little or no effort (3.7.b.5a) Offside front front brake recording little or no effort (3.7.b.5a) 03 January 2013 [11:02] 03/01/2013 937343303041 937343303041
1 Front windscreen washer provides insufficient washer liquid (8.2.3) Front windscreen washer provides insufficient washer liquid (8.2.3) 08 December 2011 [10:08] 08/12/2011 435062841470 435062841470
1 Front windscreen washer control is inaccessible to the driver (8.2.1a) Front windscreen washer control is inaccessible to the driver (8.2.1a) 08 December 2011 [10:08] 08/12/2011 435062841470 435062841470
1 Nearside front tyre tread depth below requirements of 1.6mm (4.1.e.1) Nearside front tyre tread depth below requirements of 1.6mm (4.1.e.1) 08 December 2011 [10:08] 08/12/2011 435062841470 435062841470
1 Offside headlamp aim too high and too far to the left. (1.8) Offside headlamp aim too high and too far to the left. (1.8) 08 December 2011 [10:08] 08/12/2011 435062841470 435062841470
1 Nearside front upper suspension component mounting prescribed area is excessively corroded (2.4.a.3) Nearside front upper suspension component mounting prescribed area is excessively corroded (2.4.a.3) 08 December 2011 [10:08] 08/12/2011 435062841470 435062841470
1 Direction indicators flashing more than 120 times a minute (1.4.a.2g) Direction indicators flashing more than 120 times a minute (1.4.a.2g) 08 December 2011 [10:08] 08/12/2011 435062841470 435062841470
1 Offside front brake binding (3.7.b.1) Offside front brake binding (3.7.b.1) 08 December 2011 [10:08] 08/12/2011 435062841470 435062841470
1 Brake pipe inadequately supported (3.6.b.1) Brake pipe inadequately supported (3.6.b.1) 08 December 2011 [10:08] 08/12/2011 435062841470 435062841470
1 Nearside front seat belt retracting mechanism defective (5.2.5b) Nearside front seat belt retracting mechanism defective (5.2.5b) 09 December 2010 [13:19] 09/12/2010 180603040370 180603040370
1 Steering wheel locking device insecure (2.1.6) Steering wheel locking device insecure (2.1.6) 09 December 2010 [13:19] 09/12/2010 180603040370 180603040370
1 Nearside windscreen washer provides insufficient washer liquid (8.2.3) Nearside windscreen washer provides insufficient washer liquid (8.2.3) 09 December 2010 [13:19] 09/12/2010 180603040370 180603040370
1 Offside windscreen washer provides insufficient washer liquid (8.2.3) Offside windscreen washer provides insufficient washer liquid (8.2.3) 09 December 2010 [13:19] 09/12/2010 180603040370 180603040370
1 Offside obligatory mirror insecure (8.1.1) Offside obligatory mirror insecure (8.1.1) 09 December 2010 [13:19] 09/12/2010 180603040370 180603040370
1 Indicator tell tale missing (1.4.a.2a) Indicator tell tale missing (1.4.a.2a) 09 December 2010 [13:19] 09/12/2010 180603040370 180603040370
1 Offside front direction indicator flashing more than 120 times a minute (1.4.a.2g) Offside front direction indicator flashing more than 120 times a minute (1.4.a.2g) 09 December 2010 [13:19] 09/12/2010 180603040370 180603040370
1 Offside rear direction indicator not working (1.4.a.2c) Offside rear direction indicator not working (1.4.a.2c) 09 December 2010 [13:19] 09/12/2010 180603040370 180603040370
1 Nearside stop lamp adversely affected by the operation of another lamp (1.2.1f) Nearside stop lamp adversely affected by the operation of another lamp (1.2.1f) 09 December 2010 [13:19] 09/12/2010 180603040370 180603040370
1 Offside stop lamp adversely affected by the operation of another lamp (1.2.1f) Offside stop lamp adversely affected by the operation of another lamp (1.2.1f) 09 December 2010 [13:19] 09/12/2010 180603040370 180603040370
1 Nearside rear position lamp(s) adversely affected by the operation of another lamp (1.1.a.3f) Nearside rear position lamp(s) adversely affected by the operation of another lamp (1.1.a.3f) 09 December 2010 [13:19] 09/12/2010 180603040370 180603040370
1 Offside rear position lamp(s) adversely affected by the operation of another lamp (1.1.a.3f) Offside rear position lamp(s) adversely affected by the operation of another lamp (1.1.a.3f) 09 December 2010 [13:19] 09/12/2010 180603040370 180603040370
1 Exhaust has a major leak of exhaust gases (7.1.2) Exhaust has a major leak of exhaust gases (7.1.2) 09 December 2010 [13:19] 09/12/2010 180603040370 180603040370
1 Offside front suspension arm rubber bush deteriorated resulting in excessive movement (2.4.g.2) Offside front suspension arm rubber bush deteriorated resulting in excessive movement (2.4.g.2) 09 December 2010 [13:19] 09/12/2010 180603040370 180603040370

ALL 472 PKX User Entered Faults [7]

ALL User Entered faults, ORDERED by OCCURRENCE DURING 472 PKX's MOT HISTORY
ALL 472 PKX User Entered Faults [7]
ALL User Entered faults, ORDERED by OCCURRENCE DURING 472 PKX's MOT HISTORY
Advisory Faults | source www.vehiclestats.co.uk
Fault Fault Test Date Test Date/Time Reference MOT Test Reference
2 Rear bumpstops and rear chassis starting to rust Rear bumpstops and rear chassis starting to rust 20 December 2011 [14:28] 20/12/2011 08 December 2011 [10:08] 08/12/2011 478884351422 478884351422 435062841470 435062841470
1 The exhaust down pipe is loose at the manifold joint. The exhaust down pipe is loose at the manifold joint. 22 December 2014 [09:35] 22/12/2014 616786154378 616786154378
1 The off side rear tyre is perishing The off side rear tyre is perishing 03 January 2013 [11:02] 03/01/2013 937343303041 937343303041
1 Clutch pedal anti slip pad missing Clutch pedal anti slip pad missing 09 December 2010 [13:19] 09/12/2010 180603040370 180603040370
1 Both front suspension bump stops missing Both front suspension bump stops missing 09 December 2010 [13:19] 09/12/2010 180603040370 180603040370
1 Both front top swivel bump stops missing Both front top swivel bump stops missing 09 December 2010 [13:19] 09/12/2010 180603040370 180603040370

ALL 472 PKX Pass With Rectification Faults [8]

ALL Pass With Rectification faults, ORDERED by OCCURRENCE DURING 472 PKX's MOT HISTORY
ALL 472 PKX Pass With Rectification Faults [8]
ALL Pass With Rectification faults, ORDERED by OCCURRENCE DURING 472 PKX's MOT HISTORY
Advisory Faults | source www.vehiclestats.co.uk
Fault Fault Test Date Test Date/Time Reference MOT Test Reference
1 Front windscreen washer provides insufficient washer liquid (8.2.3) Front windscreen washer provides insufficient washer liquid (8.2.3) 10 January 2017 [09:29] 10/01/2017 355947896491 355947896491
1 Central front bonnet retaining device insecure (8.4.2) Central front bonnet retaining device insecure (8.4.2) 10 January 2017 [09:29] 10/01/2017 355947896491 355947896491
1 Offside front headlamp aim too high (1.8) Offside front headlamp aim too high (1.8) 19 December 2013 [12:33] 19/12/2013 657023353316 657023353316
1 Windscreen washer provides insufficient washer liquid (8.2.3) Windscreen washer provides insufficient washer liquid (8.2.3) 19 December 2013 [12:33] 19/12/2013 657023353316 657023353316
1 Horn not working (1.6.2a) Horn not working (1.6.2a) 19 December 2013 [12:33] 19/12/2013 657023353316 657023353316
1 Nearside front front wheel bearing has excessive play (2.5.a.3c) Nearside front front wheel bearing has excessive play (2.5.a.3c) 19 December 2013 [12:33] 19/12/2013 657023353316 657023353316
1 Exhaust has a major leak of exhaust gases (7.1.2) Exhaust has a major leak of exhaust gases (7.1.2) 19 December 2013 [12:33] 19/12/2013 657023353316 657023353316
1 Nearside rear exhaust system not adequately supported (7.1.1) Nearside rear exhaust system not adequately supported (7.1.1) 19 December 2013 [12:33] 19/12/2013 657023353316 657023353316

MOT TEST: 18 December 2018 09:44:04 PASSED
MOT TEST: 18 December 2018 09:44:04 PASSED

This test (526155723433) was completed on the 18 December 2018 09:44:04 and PASSED the requirements for a valid MOT with 0 comments.

This test (526155723433) was completed on the 18 December 2018 09:44:04 and PASSED the requirements for a valid MOT with 0 comments.

Recorded mileage: 79,279

Recorded mileage: 79,279


MOT TEST: 06 January 2018 08:55:16 PASSED
MOT TEST: 06 January 2018 08:55:16 PASSED

This test (538166295511) was completed on the 06 January 2018 08:55:16 and PASSED the requirements for a valid MOT with 0 comments.

This test (538166295511) was completed on the 06 January 2018 08:55:16 and PASSED the requirements for a valid MOT with 0 comments.

Recorded mileage: 79,164

Recorded mileage: 79,164


MOT TEST: 21 December 2017 10:25:19 FAILED
MOT TEST: 21 December 2017 10:25:19 FAILED

This test (806913876545) was completed on the 21 December 2017 10:25:19 and FAILED the requirements for a valid MOT with 9 comments.

This test (806913876545) was completed on the 21 December 2017 10:25:19 and FAILED the requirements for a valid MOT with 9 comments.

Recorded mileage: 79,164

Recorded mileage: 79,164


FAIL


MOT TEST: 10 January 2017 09:29:16 PASSED
MOT TEST: 10 January 2017 09:29:16 PASSED

This test (438983099801) was completed on the 10 January 2017 09:29:16 and PASSED the requirements for a valid MOT with 3 comments.

This test (438983099801) was completed on the 10 January 2017 09:29:16 and PASSED the requirements for a valid MOT with 3 comments.

Recorded mileage: 78,793

Recorded mileage: 78,793


ADVISORY


MOT TEST: 10 January 2017 09:29:15 FAILED
MOT TEST: 10 January 2017 09:29:15 FAILED

This test (355947896491) was completed on the 10 January 2017 09:29:15 and FAILED the requirements for a valid MOT with 5 comments.

This test (355947896491) was completed on the 10 January 2017 09:29:15 and FAILED the requirements for a valid MOT with 5 comments.

Recorded mileage: 78,793

Recorded mileage: 78,793


ADVISORY

PASS WITH RECTIFICATION


MOT TEST: 27 January 2016 16:45:36 PASSED
MOT TEST: 27 January 2016 16:45:36 PASSED

This test (451640850346) was completed on the 27 January 2016 16:45:36 and PASSED the requirements for a valid MOT with 1 comments.

This test (451640850346) was completed on the 27 January 2016 16:45:36 and PASSED the requirements for a valid MOT with 1 comments.

Recorded mileage: 78,176

Recorded mileage: 78,176


ADVISORY


MOT TEST: 27 January 2016 14:41:14 FAILED
MOT TEST: 27 January 2016 14:41:14 FAILED

This test (761464964191) was completed on the 27 January 2016 14:41:14 and FAILED the requirements for a valid MOT with 3 comments.

This test (761464964191) was completed on the 27 January 2016 14:41:14 and FAILED the requirements for a valid MOT with 3 comments.

Recorded mileage: 78,176

Recorded mileage: 78,176


ADVISORY

FAIL


MOT TEST: 22 December 2014 15:54:28 PASSED
MOT TEST: 22 December 2014 15:54:28 PASSED

This test (806506654318) was completed on the 22 December 2014 15:54:28 and PASSED the requirements for a valid MOT with 0 comments.

This test (806506654318) was completed on the 22 December 2014 15:54:28 and PASSED the requirements for a valid MOT with 0 comments.

Recorded mileage: 77,589

Recorded mileage: 77,589


MOT TEST: 22 December 2014 09:35:42 FAILED
MOT TEST: 22 December 2014 09:35:42 FAILED

This test (616786154378) was completed on the 22 December 2014 09:35:42 and FAILED the requirements for a valid MOT with 9 comments.

This test (616786154378) was completed on the 22 December 2014 09:35:42 and FAILED the requirements for a valid MOT with 9 comments.

Recorded mileage: 77,589

Recorded mileage: 77,589


ADVISORY

FAIL

USER ENTERED


MOT TEST: 19 December 2013 12:33:25 PASSED
MOT TEST: 19 December 2013 12:33:25 PASSED

This test (746833253395) was completed on the 19 December 2013 12:33:25 and PASSED the requirements for a valid MOT with 0 comments.

This test (746833253395) was completed on the 19 December 2013 12:33:25 and PASSED the requirements for a valid MOT with 0 comments.

Recorded mileage: 76,156

Recorded mileage: 76,156


MOT TEST: 19 December 2013 12:33:25 FAILED
MOT TEST: 19 December 2013 12:33:25 FAILED

This test (657023353316) was completed on the 19 December 2013 12:33:25 and FAILED the requirements for a valid MOT with 6 comments.

This test (657023353316) was completed on the 19 December 2013 12:33:25 and FAILED the requirements for a valid MOT with 6 comments.

Recorded mileage: 76,156

Recorded mileage: 76,156


PASS WITH RECTIFICATION


MOT TEST: 04 January 2013 17:00:38 PASSED
MOT TEST: 04 January 2013 17:00:38 PASSED

This test (158424403096) was completed on the 04 January 2013 17:00:38 and PASSED the requirements for a valid MOT with 2 comments.

This test (158424403096) was completed on the 04 January 2013 17:00:38 and PASSED the requirements for a valid MOT with 2 comments.

Recorded mileage: 74,769

Recorded mileage: 74,769


ADVISORY


MOT TEST: 03 January 2013 11:02:09 FAILED
MOT TEST: 03 January 2013 11:02:09 FAILED

This test (937343303041) was completed on the 03 January 2013 11:02:09 and FAILED the requirements for a valid MOT with 7 comments.

This test (937343303041) was completed on the 03 January 2013 11:02:09 and FAILED the requirements for a valid MOT with 7 comments.

Recorded mileage: 74,769

Recorded mileage: 74,769


ADVISORY

FAIL

USER ENTERED


MOT TEST: 20 December 2011 14:28:00 PASSED
MOT TEST: 20 December 2011 14:28:00 PASSED

This test (478884351422) was completed on the 20 December 2011 14:28:00 and PASSED the requirements for a valid MOT with 3 comments.

This test (478884351422) was completed on the 20 December 2011 14:28:00 and PASSED the requirements for a valid MOT with 3 comments.

Recorded mileage: 74,080

Recorded mileage: 74,080


ADVISORY

USER ENTERED


MOT TEST: 08 December 2011 10:08:30 FAILED
MOT TEST: 08 December 2011 10:08:30 FAILED

This test (435062841470) was completed on the 08 December 2011 10:08:30 and FAILED the requirements for a valid MOT with 18 comments.

This test (435062841470) was completed on the 08 December 2011 10:08:30 and FAILED the requirements for a valid MOT with 18 comments.

Recorded mileage: 74,080

Recorded mileage: 74,080


ADVISORY

FAIL

USER ENTERED


MOT TEST: 29 December 2010 10:36:11 PASSED
MOT TEST: 29 December 2010 10:36:11 PASSED

This test (412203260316) was completed on the 29 December 2010 10:36:11 and PASSED the requirements for a valid MOT with 0 comments.

This test (412203260316) was completed on the 29 December 2010 10:36:11 and PASSED the requirements for a valid MOT with 0 comments.

Recorded mileage: 73,915

Recorded mileage: 73,915


MOT TEST: 09 December 2010 13:19:23 FAILED
MOT TEST: 09 December 2010 13:19:23 FAILED

This test (180603040370) was completed on the 09 December 2010 13:19:23 and FAILED the requirements for a valid MOT with 22 comments.

This test (180603040370) was completed on the 09 December 2010 13:19:23 and FAILED the requirements for a valid MOT with 22 comments.

Recorded mileage: 73,915

Recorded mileage: 73,915


ADVISORY

FAIL

USER ENTERED