477 BHR


477BHR is registered to a White 1963, Morris Minor 1000 with a Petrol engine. It Passed its most recent MOT Test on the 26 April 2019

24 unique faults (28 Total) reported in its MOT History (20 Tests).

4 common/recurring faults, the most frequent (2 times) is: Parking brake: efficiency below requirements (3.7.B.7).

70% (14) MOT Pass Rate and a 30% (6) MOT Failure Rate.

22,402 recorded miles.

477 BHR


477BHR is registered to a White 1963, Morris Minor 1000 with a Petrol engine. It Passed its most recent MOT Test on the 26 April 2019

24 unique faults (28 Total) reported in its MOT History (20 Tests).

4 common/recurring faults, the most frequent (2 times) is: Parking brake: efficiency below requirements (3.7.B.7).

70% (14) MOT Pass Rate and a 30% (6) MOT Failure Rate.

22,402 recorded miles.

MOT PASS/Failure rate for 477 BHR

all MOT test results for 477 BHR represented as a percentage
MOT PASS/Failure rate for 477 BHR
all MOT test results for 477 BHR represented as a percentage

PERCENTAGE OF VEHICLE FAULTS WITH 477 BHR

ALL REPORTED FAULTS, DISPLAYED BY PERCENTAGE OF OCCURRENCE DURING ALL MOT TESTS
PERCENTAGE OF VEHICLE FAULTS WITH 477 BHR
ALL REPORTED FAULTS, DISPLAYED BY PERCENTAGE OF OCCURRENCE DURING ALL MOT TESTS
ADVISORY

FAIL

USER ENTERED

477 BHR annual Faults by type

ALL REPORTED FAULTS, DISPLAYED over time and categorised by type
477 BHR annual Faults by type
ALL REPORTED FAULTS, DISPLAYED over time and categorised by type

RECURRING FAULTS WITH 477 BHR

FAULTS THAT HAVE OCCURED MORE THAN ONCE DURING 477 BHR's MOT HISTORY
RECURRING FAULTS WITH 477 BHR
FAULTS THAT HAVE OCCURED MORE THAN ONCE DURING 477 BHR's MOT HISTORY
Fault Fault Test Date Test Date/Time Reference MOT Test Reference
2 Parking brake: efficiency below requirements (3.7.b.7) Parking brake: efficiency below requirements (3.7.b.7) 05 May 2018 [09:28] 05/05/2018 29 May 2012 [15:47] 29/05/2012 871605631302 871605631302 205650952446 205650952446
2 Brakes imbalanced across an axle (3.7.b.5b) Brakes imbalanced across an axle (3.7.b.5b) 05 May 2018 [09:28] 05/05/2018 18 April 2008 [15:01] 18/04/2008 871605631302 871605631302 273499308438 273499308438
2 Slight play at steering wheel Slight play at steering wheel 23 April 2010 [15:30] 23/04/2010 19 April 2010 [10:09] 19/04/2010 322303410169 322303410169 940479200120 940479200120
2 Rear cross member corroded Rear cross member corroded 25 April 2008 [13:21] 25/04/2008 18 April 2008 [15:01] 18/04/2008 361936718134 361936718134 273499308438 273499308438

ALL 477 BHR ADVISORIES [2]

ALL ADVISORIES, ORDERED by OCCURRENCE DURING 477 BHR's MOT HISTORY
ALL 477 BHR ADVISORIES [2]
ALL ADVISORIES, ORDERED by OCCURRENCE DURING 477 BHR's MOT HISTORY
Fail Faults | source www.vehiclestats.co.uk
Fault Fault Test Date Test Date/Time Reference MOT Test Reference
1 Brakes imbalanced requirements only just met. It would appear that the braking system requires adjustment or repair. (3.7.b.5b) Brakes imbalanced requirements only just met. It would appear that the braking system requires adjustment or repair. (3.7.b.5b) 29 May 2012 [15:47] 29/05/2012 205650952446 205650952446
1 Offside rear parking brake: parking brake efficiency only just met. It would appear that the braking system requires adjustment or repair. (3.7.b.7) Offside rear parking brake: parking brake efficiency only just met. It would appear that the braking system requires adjustment or repair. (3.7.b.7) 13 April 2011 [11:12] 13/04/2011 235613901411 235613901411

ALL 477 BHR Failure Faults [15]

ALL Failure faults, ORDERED by OCCURRENCE DURING 477 BHR's MOT HISTORY
ALL 477 BHR Failure Faults [15]
ALL Failure faults, ORDERED by OCCURRENCE DURING 477 BHR's MOT HISTORY
Fail Faults | source www.vehiclestats.co.uk
Fault Fault Test Date Test Date/Time Reference MOT Test Reference
2 Parking brake: efficiency below requirements (3.7.b.7) Parking brake: efficiency below requirements (3.7.b.7) 05 May 2018 [09:28] 05/05/2018 29 May 2012 [15:47] 29/05/2012 871605631302 871605631302 205650952446 205650952446
2 Brakes imbalanced across an axle (3.7.b.5b) Brakes imbalanced across an axle (3.7.b.5b) 05 May 2018 [09:28] 05/05/2018 18 April 2008 [15:01] 18/04/2008 871605631302 871605631302 273499308438 273499308438
1 Nearside rear registration plate lamp not working (1.1.c.1d) Nearside rear registration plate lamp not working (1.1.c.1d) 05 May 2018 [09:28] 05/05/2018 871605631302 871605631302
1 Rear brakes imbalanced across an axle axle 2 (3.7.b.5b) Rear brakes imbalanced across an axle axle 2 (3.7.b.5b) 05 May 2018 [09:28] 05/05/2018 871605631302 871605631302
1 Nearside headlamp not working on main beam (1.7.5a) Nearside headlamp not working on main beam (1.7.5a) 12 May 2014 [09:44] 12/05/2014 356072934153 356072934153
1 Offside windscreen washer provides insufficient washer liquid (8.2.3) Offside windscreen washer provides insufficient washer liquid (8.2.3) 29 May 2012 [15:47] 29/05/2012 205650952446 205650952446
1 Brake pedal spongy (3.3.b.1b) Brake pedal spongy (3.3.b.1b) 29 May 2012 [15:47] 29/05/2012 205650952446 205650952446
1 Nearside front direction indicator not working (1.4.a.2c) Nearside front direction indicator not working (1.4.a.2c) 19 April 2010 [10:09] 19/04/2010 940479200120 940479200120
1 Offside steering rack gaiter split (2.2.d.2d) Offside steering rack gaiter split (2.2.d.2d) 19 April 2010 [10:09] 19/04/2010 940479200120 940479200120
1 Offside rear brake drum contaminated by oil (3.5.1h) Offside rear brake drum contaminated by oil (3.5.1h) 19 April 2010 [10:09] 19/04/2010 940479200120 940479200120
1 Nearside front tyre tread depth below requirements of 1.6mm (4.1.e.1) Nearside front tyre tread depth below requirements of 1.6mm (4.1.e.1) 05 April 2006 [14:51] 05/04/2006 802025796069 802025796069
1 Offside front tyre tread depth below requirements of 1.6mm (4.1.e.1) Offside front tyre tread depth below requirements of 1.6mm (4.1.e.1) 05 April 2006 [14:51] 05/04/2006 802025796069 802025796069
1 Nearside rear tyre tread depth below requirements of 1.6mm (4.1.e.1) Nearside rear tyre tread depth below requirements of 1.6mm (4.1.e.1) 05 April 2006 [14:51] 05/04/2006 802025796069 802025796069

ALL 477 BHR User Entered Faults [11]

ALL User Entered faults, ORDERED by OCCURRENCE DURING 477 BHR's MOT HISTORY
ALL 477 BHR User Entered Faults [11]
ALL User Entered faults, ORDERED by OCCURRENCE DURING 477 BHR's MOT HISTORY
User Entered Faults | source www.vehiclestats.co.uk
Fault Fault Test Date Test Date/Time Reference MOT Test Reference
2 Slight play at steering wheel Slight play at steering wheel 23 April 2010 [15:30] 23/04/2010 19 April 2010 [10:09] 19/04/2010 322303410169 322303410169 940479200120 940479200120
2 Rear cross member corroded Rear cross member corroded 25 April 2008 [13:21] 25/04/2008 18 April 2008 [15:01] 18/04/2008 361936718134 361936718134 273499308438 273499308438
1 Oil leak Oil leak 28 May 2013 [10:04] 28/05/2013 925838943144 925838943144
1 Slight noise at nearside front wheel bearing Slight noise at nearside front wheel bearing 28 May 2013 [10:04] 28/05/2013 925838943144 925838943144
1 Offside rear hub damp Offside rear hub damp 21 April 2009 [15:37] 21/04/2009 801391219196 801391219196
1 Slight binding at offside rear brake Slight binding at offside rear brake 21 April 2009 [15:37] 21/04/2009 801391219196 801391219196
1 Offside and nearside front inner wheel arches corroded Offside and nearside front inner wheel arches corroded 21 April 2009 [15:37] 21/04/2009 801391219196 801391219196
1 Slight play at steering column/steering wheel Slight play at steering column/steering wheel 21 April 2009 [15:37] 21/04/2009 801391219196 801391219196
1 Surface corrosion to doors and chassis Surface corrosion to doors and chassis 24 April 2007 [14:04] 24/04/2007 613134217125 613134217125

MOT TEST: 26 April 2019 16:19:36 PASSED
MOT TEST: 26 April 2019 16:19:36 PASSED

This test (522604513729) was completed on the 26 April 2019 16:19:36 and PASSED the requirements for a valid MOT with 0 comments.

This test (522604513729) was completed on the 26 April 2019 16:19:36 and PASSED the requirements for a valid MOT with 0 comments.

Recorded mileage: 22,402

Recorded mileage: 22,402


MOT TEST: 05 May 2018 16:39:26 PASSED
MOT TEST: 05 May 2018 16:39:26 PASSED

This test (831368317273) was completed on the 05 May 2018 16:39:26 and PASSED the requirements for a valid MOT with 0 comments.

This test (831368317273) was completed on the 05 May 2018 16:39:26 and PASSED the requirements for a valid MOT with 0 comments.

Recorded mileage: 21,902

Recorded mileage: 21,902


MOT TEST: 05 May 2018 09:28:28 FAILED
MOT TEST: 05 May 2018 09:28:28 FAILED

This test (871605631302) was completed on the 05 May 2018 09:28:28 and FAILED the requirements for a valid MOT with 4 comments.

This test (871605631302) was completed on the 05 May 2018 09:28:28 and FAILED the requirements for a valid MOT with 4 comments.

Recorded mileage: 21,902

Recorded mileage: 21,902


FAIL


MOT TEST: 18 May 2017 08:51:58 PASSED
MOT TEST: 18 May 2017 08:51:58 PASSED

This test (868954009887) was completed on the 18 May 2017 08:51:58 and PASSED the requirements for a valid MOT with 0 comments.

This test (868954009887) was completed on the 18 May 2017 08:51:58 and PASSED the requirements for a valid MOT with 0 comments.

Recorded mileage: 21,681

Recorded mileage: 21,681


MOT TEST: 19 May 2016 08:41:18 PASSED
MOT TEST: 19 May 2016 08:41:18 PASSED

This test (653641528008) was completed on the 19 May 2016 08:41:18 and PASSED the requirements for a valid MOT with 0 comments.

This test (653641528008) was completed on the 19 May 2016 08:41:18 and PASSED the requirements for a valid MOT with 0 comments.

Recorded mileage: 21,360

Recorded mileage: 21,360


MOT TEST: 01 May 2015 14:31:29 PASSED
MOT TEST: 01 May 2015 14:31:29 PASSED

This test (787641425198) was completed on the 01 May 2015 14:31:29 and PASSED the requirements for a valid MOT with 0 comments.

This test (787641425198) was completed on the 01 May 2015 14:31:29 and PASSED the requirements for a valid MOT with 0 comments.

Recorded mileage: 21,047

Recorded mileage: 21,047


MOT TEST: 12 May 2014 11:02:23 PASSED
MOT TEST: 12 May 2014 11:02:23 PASSED

This test (626632234156) was completed on the 12 May 2014 11:02:23 and PASSED the requirements for a valid MOT with 0 comments.

This test (626632234156) was completed on the 12 May 2014 11:02:23 and PASSED the requirements for a valid MOT with 0 comments.

Recorded mileage: 20,816

Recorded mileage: 20,816


MOT TEST: 12 May 2014 09:44:40 FAILED
MOT TEST: 12 May 2014 09:44:40 FAILED

This test (356072934153) was completed on the 12 May 2014 09:44:40 and FAILED the requirements for a valid MOT with 1 comments.

This test (356072934153) was completed on the 12 May 2014 09:44:40 and FAILED the requirements for a valid MOT with 1 comments.

Recorded mileage: 20,816

Recorded mileage: 20,816


FAIL


MOT TEST: 28 May 2013 10:04:36 PASSED
MOT TEST: 28 May 2013 10:04:36 PASSED

This test (925838943144) was completed on the 28 May 2013 10:04:36 and PASSED the requirements for a valid MOT with 2 comments.

This test (925838943144) was completed on the 28 May 2013 10:04:36 and PASSED the requirements for a valid MOT with 2 comments.

Recorded mileage: 20,511

Recorded mileage: 20,511


USER ENTERED


MOT TEST: 31 May 2012 16:51:22 PASSED
MOT TEST: 31 May 2012 16:51:22 PASSED

This test (239062952138) was completed on the 31 May 2012 16:51:22 and PASSED the requirements for a valid MOT with 0 comments.

This test (239062952138) was completed on the 31 May 2012 16:51:22 and PASSED the requirements for a valid MOT with 0 comments.

Recorded mileage: 19,369

Recorded mileage: 19,369


MOT TEST: 29 May 2012 15:47:51 FAILED
MOT TEST: 29 May 2012 15:47:51 FAILED

This test (205650952446) was completed on the 29 May 2012 15:47:51 and FAILED the requirements for a valid MOT with 4 comments.

This test (205650952446) was completed on the 29 May 2012 15:47:51 and FAILED the requirements for a valid MOT with 4 comments.

Recorded mileage: 19,368

Recorded mileage: 19,368


ADVISORY

FAIL


MOT TEST: 13 April 2011 11:12:50 PASSED
MOT TEST: 13 April 2011 11:12:50 PASSED

This test (235613901411) was completed on the 13 April 2011 11:12:50 and PASSED the requirements for a valid MOT with 1 comments.

This test (235613901411) was completed on the 13 April 2011 11:12:50 and PASSED the requirements for a valid MOT with 1 comments.

Recorded mileage: 19,152

Recorded mileage: 19,152


ADVISORY


MOT TEST: 23 April 2010 15:30:34 PASSED
MOT TEST: 23 April 2010 15:30:34 PASSED

This test (322303410169) was completed on the 23 April 2010 15:30:34 and PASSED the requirements for a valid MOT with 1 comments.

This test (322303410169) was completed on the 23 April 2010 15:30:34 and PASSED the requirements for a valid MOT with 1 comments.

Recorded mileage: 19,076

Recorded mileage: 19,076


USER ENTERED


MOT TEST: 19 April 2010 10:09:26 FAILED
MOT TEST: 19 April 2010 10:09:26 FAILED

This test (940479200120) was completed on the 19 April 2010 10:09:26 and FAILED the requirements for a valid MOT with 4 comments.

This test (940479200120) was completed on the 19 April 2010 10:09:26 and FAILED the requirements for a valid MOT with 4 comments.

Recorded mileage: 19,076

Recorded mileage: 19,076


FAIL

USER ENTERED


MOT TEST: 21 April 2009 15:37:13 PASSED
MOT TEST: 21 April 2009 15:37:13 PASSED

This test (801391219196) was completed on the 21 April 2009 15:37:13 and PASSED the requirements for a valid MOT with 4 comments.

This test (801391219196) was completed on the 21 April 2009 15:37:13 and PASSED the requirements for a valid MOT with 4 comments.

Recorded mileage: 18,776

Recorded mileage: 18,776


USER ENTERED


MOT TEST: 25 April 2008 13:21:53 PASSED
MOT TEST: 25 April 2008 13:21:53 PASSED

This test (361936718134) was completed on the 25 April 2008 13:21:53 and PASSED the requirements for a valid MOT with 1 comments.

This test (361936718134) was completed on the 25 April 2008 13:21:53 and PASSED the requirements for a valid MOT with 1 comments.

Recorded mileage: 18,696

Recorded mileage: 18,696


USER ENTERED


MOT TEST: 18 April 2008 15:01:46 FAILED
MOT TEST: 18 April 2008 15:01:46 FAILED

This test (273499308438) was completed on the 18 April 2008 15:01:46 and FAILED the requirements for a valid MOT with 2 comments.

This test (273499308438) was completed on the 18 April 2008 15:01:46 and FAILED the requirements for a valid MOT with 2 comments.

Recorded mileage: 18,695

Recorded mileage: 18,695


FAIL

USER ENTERED


MOT TEST: 24 April 2007 14:04:01 PASSED
MOT TEST: 24 April 2007 14:04:01 PASSED

This test (613134217125) was completed on the 24 April 2007 14:04:01 and PASSED the requirements for a valid MOT with 1 comments.

This test (613134217125) was completed on the 24 April 2007 14:04:01 and PASSED the requirements for a valid MOT with 1 comments.

Recorded mileage: 18,398

Recorded mileage: 18,398


USER ENTERED


MOT TEST: 07 April 2006 15:11:27 PASSED
MOT TEST: 07 April 2006 15:11:27 PASSED

This test (582957396000) was completed on the 07 April 2006 15:11:27 and PASSED the requirements for a valid MOT with 0 comments.

This test (582957396000) was completed on the 07 April 2006 15:11:27 and PASSED the requirements for a valid MOT with 0 comments.

Recorded mileage: 18,175

Recorded mileage: 18,175


MOT TEST: 05 April 2006 14:51:30 FAILED
MOT TEST: 05 April 2006 14:51:30 FAILED

This test (802025796069) was completed on the 05 April 2006 14:51:30 and FAILED the requirements for a valid MOT with 3 comments.

This test (802025796069) was completed on the 05 April 2006 14:51:30 and FAILED the requirements for a valid MOT with 3 comments.

Recorded mileage: 18,166

Recorded mileage: 18,166


FAIL