478 CXK


478CXK is registered to a White 1961, Morris Minor with a Petrol engine. It Passed its most recent MOT Test on the 24 May 2018

17 unique faults (20 Total) reported in its MOT History (13 Tests).

3 common/recurring faults, the most frequent (2 times) is: Windscreen washer provides insufficient washer liquid (8.2.3).

62% (8) MOT Pass Rate and a 38% (5) MOT Failure Rate.

46,935 recorded miles.

478 CXK


478CXK is registered to a White 1961, Morris Minor with a Petrol engine. It Passed its most recent MOT Test on the 24 May 2018

17 unique faults (20 Total) reported in its MOT History (13 Tests).

3 common/recurring faults, the most frequent (2 times) is: Windscreen washer provides insufficient washer liquid (8.2.3).

62% (8) MOT Pass Rate and a 38% (5) MOT Failure Rate.

46,935 recorded miles.

MOT PASS/Failure rate for 478 CXK

all MOT test results for 478 CXK represented as a percentage
MOT PASS/Failure rate for 478 CXK
all MOT test results for 478 CXK represented as a percentage

PERCENTAGE OF VEHICLE FAULTS WITH 478 CXK

ALL REPORTED FAULTS, DISPLAYED BY PERCENTAGE OF OCCURRENCE DURING ALL MOT TESTS
PERCENTAGE OF VEHICLE FAULTS WITH 478 CXK
ALL REPORTED FAULTS, DISPLAYED BY PERCENTAGE OF OCCURRENCE DURING ALL MOT TESTS
FAIL

PASS WITH RECTIFICATION

478 CXK annual Faults by type

ALL REPORTED FAULTS, DISPLAYED over time and categorised by type
478 CXK annual Faults by type
ALL REPORTED FAULTS, DISPLAYED over time and categorised by type

RECURRING FAULTS WITH 478 CXK

FAULTS THAT HAVE OCCURED MORE THAN ONCE DURING 478 CXK's MOT HISTORY
RECURRING FAULTS WITH 478 CXK
FAULTS THAT HAVE OCCURED MORE THAN ONCE DURING 478 CXK's MOT HISTORY
Fault Fault Test Date Test Date/Time Reference MOT Test Reference
2 Windscreen washer provides insufficient washer liquid (8.2.3) Windscreen washer provides insufficient washer liquid (8.2.3) 25 April 2017 [14:24] 25/04/2017 07 December 2011 [12:12] 07/12/2011 754518538796 754518538796 328291941359 328291941359
2 Registration plate lamp not working (1.1.c.1d) Registration plate lamp not working (1.1.c.1d) 25 April 2017 [14:24] 25/04/2017 05 April 2007 [08:50] 05/04/2007 754518538796 754518538796 362035997099 362035997099
2 Parking brake: efficiency below requirements (3.7.b.7) Parking brake: efficiency below requirements (3.7.b.7) 25 April 2017 [14:24] 25/04/2017 27 November 2012 [14:57] 27/11/2012 754518538796 754518538796 118462532332 118462532332

ALL 478 CXK Failure Faults [18]

ALL Failure faults, ORDERED by OCCURRENCE DURING 478 CXK's MOT HISTORY
ALL 478 CXK Failure Faults [18]
ALL Failure faults, ORDERED by OCCURRENCE DURING 478 CXK's MOT HISTORY
Fail Faults | source www.vehiclestats.co.uk
Fault Fault Test Date Test Date/Time Reference MOT Test Reference
2 Windscreen washer provides insufficient washer liquid (8.2.3) Windscreen washer provides insufficient washer liquid (8.2.3) 25 April 2017 [14:24] 25/04/2017 07 December 2011 [12:12] 07/12/2011 754518538796 754518538796 328291941359 328291941359
2 Registration plate lamp not working (1.1.c.1d) Registration plate lamp not working (1.1.c.1d) 25 April 2017 [14:24] 25/04/2017 05 April 2007 [08:50] 05/04/2007 754518538796 754518538796 362035997099 362035997099
2 Parking brake: efficiency below requirements (3.7.b.7) Parking brake: efficiency below requirements (3.7.b.7) 25 April 2017 [14:24] 25/04/2017 27 November 2012 [14:57] 27/11/2012 754518538796 754518538796 118462532332 118462532332
1 Rear brakes imbalanced across an axle axle 2 (3.7.b.5b) Rear brakes imbalanced across an axle axle 2 (3.7.b.5b) 25 April 2017 [14:24] 25/04/2017 754518538796 754518538796
1 Nearside rear position lamp(s) not working (1.1.a.3b) Nearside rear position lamp(s) not working (1.1.a.3b) 27 November 2012 [14:57] 27/11/2012 118462532332 118462532332
1 Brakes imbalanced across an axle (3.7.b.5b) Brakes imbalanced across an axle (3.7.b.5b) 27 November 2012 [14:57] 27/11/2012 118462532332 118462532332
1 Windscreen wiper not operating automatically when switched on (8.2.1b) Windscreen wiper not operating automatically when switched on (8.2.1b) 07 December 2011 [12:12] 07/12/2011 328291941359 328291941359
1 Nearside rear tyre has a tear, caused by separation or partial failure of its structure (4.1.d.1b) Nearside rear tyre has a tear, caused by separation or partial failure of its structure (4.1.d.1b) 07 December 2011 [12:12] 07/12/2011 328291941359 328291941359
1 Front position lamp(s) not working (1.1.a.3b) Front position lamp(s) not working (1.1.a.3b) 07 December 2011 [12:12] 07/12/2011 328291941359 328291941359
1 Headlamp not working on dipped beam (1.7.5a) Headlamp not working on dipped beam (1.7.5a) 07 December 2011 [12:12] 07/12/2011 328291941359 328291941359
1 Stop lamp not working (1.2.1b) Stop lamp not working (1.2.1b) 07 December 2011 [12:12] 07/12/2011 328291941359 328291941359
1 Registration plate lamp not illuminating the registration plate (1.1.c.1e) Registration plate lamp not illuminating the registration plate (1.1.c.1e) 07 December 2011 [12:12] 07/12/2011 328291941359 328291941359
1 Semaphore indicator tell tale not working correctly (1.4.c.2) Semaphore indicator tell tale not working correctly (1.4.c.2) 07 December 2011 [12:12] 07/12/2011 328291941359 328291941359
1 Offside headlamp not working on dipped beam (1.7.5a) Offside headlamp not working on dipped beam (1.7.5a) 05 April 2007 [08:50] 05/04/2007 362035997099 362035997099
1 Offside headlamp not working on main beam (1.7.5a) Offside headlamp not working on main beam (1.7.5a) 05 April 2007 [08:50] 05/04/2007 362035997099 362035997099

ALL 478 CXK Pass With Rectification Faults [2]

ALL Pass With Rectification faults, ORDERED by OCCURRENCE DURING 478 CXK's MOT HISTORY
ALL 478 CXK Pass With Rectification Faults [2]
ALL Pass With Rectification faults, ORDERED by OCCURRENCE DURING 478 CXK's MOT HISTORY
Pass With Rectification Faults | source www.vehiclestats.co.uk
Fault Fault Test Date Test Date/Time Reference MOT Test Reference
1 Offside front headlamp not working on main beam (1.7.5a) Offside front headlamp not working on main beam (1.7.5a) 21 December 2011 [15:27] 21/12/2011 767135651317 767135651317
1 Offside rear front brake recording little or no effort (3.7.b.5a) Offside rear front brake recording little or no effort (3.7.b.5a) 21 December 2011 [15:27] 21/12/2011 767135651317 767135651317

MOT TEST: 24 May 2018 07:31:22 PASSED
MOT TEST: 24 May 2018 07:31:22 PASSED

This test (780429896517) was completed on the 24 May 2018 07:31:22 and PASSED the requirements for a valid MOT with 0 comments.

This test (780429896517) was completed on the 24 May 2018 07:31:22 and PASSED the requirements for a valid MOT with 0 comments.

Recorded mileage: 8,588

Recorded mileage: 8,588


MOT TEST: 27 April 2017 14:45:51 PASSED
MOT TEST: 27 April 2017 14:45:51 PASSED

This test (211978466598) was completed on the 27 April 2017 14:45:51 and PASSED the requirements for a valid MOT with 0 comments.

This test (211978466598) was completed on the 27 April 2017 14:45:51 and PASSED the requirements for a valid MOT with 0 comments.

Recorded mileage: 8,578

Recorded mileage: 8,578


MOT TEST: 25 April 2017 14:24:11 FAILED
MOT TEST: 25 April 2017 14:24:11 FAILED

This test (754518538796) was completed on the 25 April 2017 14:24:11 and FAILED the requirements for a valid MOT with 4 comments.

This test (754518538796) was completed on the 25 April 2017 14:24:11 and FAILED the requirements for a valid MOT with 4 comments.

Recorded mileage: 8,578

Recorded mileage: 8,578


FAIL


MOT TEST: 25 May 2016 10:16:33 PASSED
MOT TEST: 25 May 2016 10:16:33 PASSED

This test (398325509200) was completed on the 25 May 2016 10:16:33 and PASSED the requirements for a valid MOT with 0 comments.

This test (398325509200) was completed on the 25 May 2016 10:16:33 and PASSED the requirements for a valid MOT with 0 comments.

Recorded mileage: 8,017

Recorded mileage: 8,017


MOT TEST: 19 May 2015 12:21:21 PASSED
MOT TEST: 19 May 2015 12:21:21 PASSED

This test (379039235120) was completed on the 19 May 2015 12:21:21 and PASSED the requirements for a valid MOT with 0 comments.

This test (379039235120) was completed on the 19 May 2015 12:21:21 and PASSED the requirements for a valid MOT with 0 comments.

Recorded mileage: 7,301

Recorded mileage: 7,301


MOT TEST: 20 May 2014 15:08:18 PASSED
MOT TEST: 20 May 2014 15:08:18 PASSED

This test (267760944403) was completed on the 20 May 2014 15:08:18 and PASSED the requirements for a valid MOT with 0 comments.

This test (267760944403) was completed on the 20 May 2014 15:08:18 and PASSED the requirements for a valid MOT with 0 comments.

Recorded mileage: 6,540

Recorded mileage: 6,540


MOT TEST: 04 December 2012 16:54:55 PASSED
MOT TEST: 04 December 2012 16:54:55 PASSED

This test (237269832383) was completed on the 04 December 2012 16:54:55 and PASSED the requirements for a valid MOT with 0 comments.

This test (237269832383) was completed on the 04 December 2012 16:54:55 and PASSED the requirements for a valid MOT with 0 comments.

Recorded mileage: 5,274

Recorded mileage: 5,274


MOT TEST: 27 November 2012 14:57:16 FAILED
MOT TEST: 27 November 2012 14:57:16 FAILED

This test (118462532332) was completed on the 27 November 2012 14:57:16 and FAILED the requirements for a valid MOT with 3 comments.

This test (118462532332) was completed on the 27 November 2012 14:57:16 and FAILED the requirements for a valid MOT with 3 comments.

Recorded mileage: 5,628

Recorded mileage: 5,628


FAIL


MOT TEST: 21 December 2011 15:27:14 PASSED
MOT TEST: 21 December 2011 15:27:14 PASSED

This test (789655751355) was completed on the 21 December 2011 15:27:14 and PASSED the requirements for a valid MOT with 0 comments.

This test (789655751355) was completed on the 21 December 2011 15:27:14 and PASSED the requirements for a valid MOT with 0 comments.

Recorded mileage: 4,640

Recorded mileage: 4,640


MOT TEST: 21 December 2011 15:27:14 FAILED
MOT TEST: 21 December 2011 15:27:14 FAILED

This test (767135651317) was completed on the 21 December 2011 15:27:14 and FAILED the requirements for a valid MOT with 2 comments.

This test (767135651317) was completed on the 21 December 2011 15:27:14 and FAILED the requirements for a valid MOT with 2 comments.

Recorded mileage: 4,640

Recorded mileage: 4,640


PASS WITH RECTIFICATION


MOT TEST: 07 December 2011 12:12:25 FAILED
MOT TEST: 07 December 2011 12:12:25 FAILED

This test (328291941359) was completed on the 07 December 2011 12:12:25 and FAILED the requirements for a valid MOT with 8 comments.

This test (328291941359) was completed on the 07 December 2011 12:12:25 and FAILED the requirements for a valid MOT with 8 comments.

Recorded mileage: 46,935

Recorded mileage: 46,935


FAIL


MOT TEST: 12 April 2007 10:16:04 PASSED
MOT TEST: 12 April 2007 10:16:04 PASSED

This test (782332207176) was completed on the 12 April 2007 10:16:04 and PASSED the requirements for a valid MOT with 0 comments.

This test (782332207176) was completed on the 12 April 2007 10:16:04 and PASSED the requirements for a valid MOT with 0 comments.

Recorded mileage: 4,668

Recorded mileage: 4,668


MOT TEST: 05 April 2007 08:50:24 FAILED
MOT TEST: 05 April 2007 08:50:24 FAILED

This test (362035997099) was completed on the 05 April 2007 08:50:24 and FAILED the requirements for a valid MOT with 3 comments.

This test (362035997099) was completed on the 05 April 2007 08:50:24 and FAILED the requirements for a valid MOT with 3 comments.

Recorded mileage: 4,668

Recorded mileage: 4,668


FAIL