491 UPK


491UPK is registered to a Green 1961, Morris Minor with a Petrol engine. It Failed its most recent MOT Test on the 19 July 2017

10 unique faults (11 Total) reported in its MOT History (4 Tests).

1 common/recurring faults.

50% (2) MOT Pass Rate and a 50% (2) MOT Failure Rate.

23,880 recorded miles.

491 UPK


491UPK is registered to a Green 1961, Morris Minor with a Petrol engine. It Failed its most recent MOT Test on the 19 July 2017

10 unique faults (11 Total) reported in its MOT History (4 Tests).

1 common/recurring faults.

50% (2) MOT Pass Rate and a 50% (2) MOT Failure Rate.

23,880 recorded miles.

MOT PASS/Failure rate for 491 UPK

all MOT test results for 491 UPK represented as a percentage
MOT PASS/Failure rate for 491 UPK
all MOT test results for 491 UPK represented as a percentage

PERCENTAGE OF VEHICLE FAULTS WITH 491 UPK

ALL REPORTED FAULTS, DISPLAYED BY PERCENTAGE OF OCCURRENCE DURING ALL MOT TESTS
PERCENTAGE OF VEHICLE FAULTS WITH 491 UPK
ALL REPORTED FAULTS, DISPLAYED BY PERCENTAGE OF OCCURRENCE DURING ALL MOT TESTS
ADVISORY

FAIL

USER ENTERED

491 UPK annual Faults by type

ALL REPORTED FAULTS, DISPLAYED over time and categorised by type
491 UPK annual Faults by type
ALL REPORTED FAULTS, DISPLAYED over time and categorised by type

ALL 491 UPK ADVISORIES [3]

ALL ADVISORIES, ORDERED by OCCURRENCE DURING 491 UPK's MOT HISTORY
ALL 491 UPK ADVISORIES [3]
ALL ADVISORIES, ORDERED by OCCURRENCE DURING 491 UPK's MOT HISTORY
Advisory Faults | source www.vehiclestats.co.uk
Fault Fault Test Date Test Date/Time Reference MOT Test Reference
2 Front brake disc worn, pitted or scored, but not seriously weakened (3.5.1i) Front brake disc worn, pitted or scored, but not seriously weakened (3.5.1i) 19 July 2017 [08:56] 19/07/2017 19 June 2017 [12:51] 19/06/2017 419135086209 419135086209 336808445957 336808445957
1 Parking brake lever has little reserve travel (3.1.6b) Parking brake lever has little reserve travel (3.1.6b) 19 June 2017 [12:51] 19/06/2017 336808445957 336808445957

ALL 491 UPK Failure Faults [7]

ALL Failure faults, ORDERED by OCCURRENCE DURING 491 UPK's MOT HISTORY
ALL 491 UPK Failure Faults [7]
ALL Failure faults, ORDERED by OCCURRENCE DURING 491 UPK's MOT HISTORY
Advisory Faults | source www.vehiclestats.co.uk
Fault Fault Test Date Test Date/Time Reference MOT Test Reference
1 Nearside headlamp not working on dipped beam (1.7.5a) Nearside headlamp not working on dipped beam (1.7.5a) 19 June 2017 [12:51] 19/06/2017 336808445957 336808445957
1 Headlamp switch insecure (1.7.1) Headlamp switch insecure (1.7.1) 19 June 2017 [12:51] 19/06/2017 336808445957 336808445957
1 Front windscreen wiper does not clear the windscreen effectively (8.2.2) Front windscreen wiper does not clear the windscreen effectively (8.2.2) 19 June 2017 [12:51] 19/06/2017 336808445957 336808445957
1 Offside rear wheel bearing rough when rotated (2.6.1) Offside rear wheel bearing rough when rotated (2.6.1) 19 June 2017 [12:51] 19/06/2017 336808445957 336808445957
1 Nearside front upper shock absorber has a serious fluid leak (2.7.3) Nearside front upper shock absorber has a serious fluid leak (2.7.3) 19 June 2017 [12:51] 19/06/2017 336808445957 336808445957
1 Headlamp switch faulty (1.7.1) Headlamp switch faulty (1.7.1) 19 June 2017 [12:51] 19/06/2017 336808445957 336808445957
1 Offside front suspension arm attachment bracket/mounting corroded and its strength is seriously reduced (2.4.g.1) Offside front suspension arm attachment bracket/mounting corroded and its strength is seriously reduced (2.4.g.1) 17 May 2005 [17:09] 17/05/2005 823217135152 823217135152

ALL 491 UPK User Entered Faults [1]

ALL User Entered faults, ORDERED by OCCURRENCE DURING 491 UPK's MOT HISTORY
ALL 491 UPK User Entered Faults [1]
ALL User Entered faults, ORDERED by OCCURRENCE DURING 491 UPK's MOT HISTORY
Fail Faults | source www.vehiclestats.co.uk
Fault Fault Test Date Test Date/Time Reference MOT Test Reference
1 Offside front suspension rubber bump stop missing,corroded around area,see failure sheet. Offside front suspension rubber bump stop missing,corroded around area,see failure sheet. 17 May 2005 [17:09] 17/05/2005 823217135152 823217135152

MOT TEST: 19 July 2017 08:56:39 PASSED
MOT TEST: 19 July 2017 08:56:39 PASSED

This test (419135086209) was completed on the 19 July 2017 08:56:39 and PASSED the requirements for a valid MOT with 1 comments.

This test (419135086209) was completed on the 19 July 2017 08:56:39 and PASSED the requirements for a valid MOT with 1 comments.

Recorded mileage: 23,880

Recorded mileage: 23,880


ADVISORY


MOT TEST: 19 June 2017 12:51:07 FAILED
MOT TEST: 19 June 2017 12:51:07 FAILED

This test (336808445957) was completed on the 19 June 2017 12:51:07 and FAILED the requirements for a valid MOT with 8 comments.

This test (336808445957) was completed on the 19 June 2017 12:51:07 and FAILED the requirements for a valid MOT with 8 comments.

Recorded mileage: 23,879

Recorded mileage: 23,879


ADVISORY

FAIL


MOT TEST: 19 May 2005 09:32:00 PASSED
MOT TEST: 19 May 2005 09:32:00 PASSED

This test (294019235432) was completed on the 19 May 2005 09:32:00 and PASSED the requirements for a valid MOT with 0 comments.

This test (294019235432) was completed on the 19 May 2005 09:32:00 and PASSED the requirements for a valid MOT with 0 comments.

Recorded mileage: 23,849

Recorded mileage: 23,849


MOT TEST: 17 May 2005 17:09:51 FAILED
MOT TEST: 17 May 2005 17:09:51 FAILED

This test (823217135152) was completed on the 17 May 2005 17:09:51 and FAILED the requirements for a valid MOT with 2 comments.

This test (823217135152) was completed on the 17 May 2005 17:09:51 and FAILED the requirements for a valid MOT with 2 comments.

Recorded mileage: 23,849

Recorded mileage: 23,849


FAIL

USER ENTERED