504 XUX


504XUX is registered to a Blue 1961, Morris Minor with a Petrol engine. It Failed its most recent MOT Test on the 10 July 2017

16 unique faults (19 Total) reported in its MOT History (14 Tests).

3 common/recurring faults, the most frequent (2 times) is: Nearside Front Lower Suspension arm rubber bush deteriorated but not resulting in excessive movement (2.4.G.2).

71% (10) MOT Pass Rate and a 29% (4) MOT Failure Rate.

54,957 recorded miles.

504 XUX


504XUX is registered to a Blue 1961, Morris Minor with a Petrol engine. It Failed its most recent MOT Test on the 10 July 2017

16 unique faults (19 Total) reported in its MOT History (14 Tests).

3 common/recurring faults, the most frequent (2 times) is: Nearside Front Lower Suspension arm rubber bush deteriorated but not resulting in excessive movement (2.4.G.2).

71% (10) MOT Pass Rate and a 29% (4) MOT Failure Rate.

54,957 recorded miles.

MOT PASS/Failure rate for 504 XUX

all MOT test results for 504 XUX represented as a percentage
MOT PASS/Failure rate for 504 XUX
all MOT test results for 504 XUX represented as a percentage

PERCENTAGE OF VEHICLE FAULTS WITH 504 XUX

ALL REPORTED FAULTS, DISPLAYED BY PERCENTAGE OF OCCURRENCE DURING ALL MOT TESTS
PERCENTAGE OF VEHICLE FAULTS WITH 504 XUX
ALL REPORTED FAULTS, DISPLAYED BY PERCENTAGE OF OCCURRENCE DURING ALL MOT TESTS
ADVISORY

FAIL

USER ENTERED

PASS WITH RECTIFICATION

504 XUX annual Faults by type

ALL REPORTED FAULTS, DISPLAYED over time and categorised by type
504 XUX annual Faults by type
ALL REPORTED FAULTS, DISPLAYED over time and categorised by type

RECURRING FAULTS WITH 504 XUX

FAULTS THAT HAVE OCCURED MORE THAN ONCE DURING 504 XUX's MOT HISTORY
RECURRING FAULTS WITH 504 XUX
FAULTS THAT HAVE OCCURED MORE THAN ONCE DURING 504 XUX's MOT HISTORY
Fault Fault Test Date Test Date/Time Reference MOT Test Reference
2 Nearside front lower suspension arm rubber bush deteriorated but not resulting in excessive movement (2.4.g.2) Nearside front lower suspension arm rubber bush deteriorated but not resulting in excessive movement (2.4.g.2) 11 July 2015 [10:17] 11/07/2015 08 July 2014 [10:49] 08/07/2014 259532495499 259532495499 439409784136 439409784136
2 Offside front lower suspension arm rubber bush deteriorated but not resulting in excessive movement (2.4.g.2) Offside front lower suspension arm rubber bush deteriorated but not resulting in excessive movement (2.4.g.2) 11 July 2015 [10:17] 11/07/2015 08 July 2014 [10:49] 08/07/2014 259532495499 259532495499 439409784136 439409784136
2 Vehicle has had extensive welding repairs carried out. (repairs at time of test appear to be satisfactory) also vehicle has had heavy underseal applied Vehicle has had extensive welding repairs carried out. (repairs at time of test appear to be satisfactory) also vehicle has had heavy underseal applied 08 September 2009 [08:31] 08/09/2009 03 September 2009 [12:56] 03/09/2009 801031359222 801031359222 742336649206 742336649206

ALL 504 XUX ADVISORIES [6]

ALL ADVISORIES, ORDERED by OCCURRENCE DURING 504 XUX's MOT HISTORY
ALL 504 XUX ADVISORIES [6]
ALL ADVISORIES, ORDERED by OCCURRENCE DURING 504 XUX's MOT HISTORY
Advisory Faults | source www.vehiclestats.co.uk
Fault Fault Test Date Test Date/Time Reference MOT Test Reference
2 Nearside front lower suspension arm rubber bush deteriorated but not resulting in excessive movement (2.4.g.2) Nearside front lower suspension arm rubber bush deteriorated but not resulting in excessive movement (2.4.g.2) 11 July 2015 [10:17] 11/07/2015 08 July 2014 [10:49] 08/07/2014 259532495499 259532495499 439409784136 439409784136
2 Offside front lower suspension arm rubber bush deteriorated but not resulting in excessive movement (2.4.g.2) Offside front lower suspension arm rubber bush deteriorated but not resulting in excessive movement (2.4.g.2) 11 July 2015 [10:17] 11/07/2015 08 July 2014 [10:49] 08/07/2014 259532495499 259532495499 439409784136 439409784136
1 Offside front wheel bearing has slight play (2.5.a.3c) Offside front wheel bearing has slight play (2.5.a.3c) 09 August 2010 [10:27] 09/08/2010 720171320247 720171320247
1 Nearside front wheel bearing has slight play (2.5.a.3c) Nearside front wheel bearing has slight play (2.5.a.3c) 09 August 2010 [10:27] 09/08/2010 720171320247 720171320247

ALL 504 XUX Failure Faults [9]

ALL Failure faults, ORDERED by OCCURRENCE DURING 504 XUX's MOT HISTORY
ALL 504 XUX Failure Faults [9]
ALL Failure faults, ORDERED by OCCURRENCE DURING 504 XUX's MOT HISTORY
Fail Faults | source www.vehiclestats.co.uk
Fault Fault Test Date Test Date/Time Reference MOT Test Reference
1 Nearside front brake binding (3.7.b.1) Nearside front brake binding (3.7.b.1) 10 July 2017 [09:18] 10/07/2017 520189675935 520189675935
1 Nearside headlamp aim too low (1.8) Nearside headlamp aim too low (1.8) 10 July 2017 [09:18] 10/07/2017 520189675935 520189675935
1 Nearside rear rear brake binding (3.7.b.1) Nearside rear rear brake binding (3.7.b.1) 11 July 2016 [13:43] 11/07/2016 403189103319 403189103319
1 Rear registration plate lamp not working (1.1.5c) Rear registration plate lamp not working (1.1.5c) 03 September 2009 [12:56] 03/09/2009 742336649206 742336649206
1 Dipswitch operation does not deflect all main beam headlamps to make them dipped beams (1.7.4b) Dipswitch operation does not deflect all main beam headlamps to make them dipped beams (1.7.4b) 03 September 2009 [12:56] 03/09/2009 742336649206 742336649206
1 Offside rear tie bar/rod attachment bracket/mounting nut missing (2.4.g.1) Offside rear tie bar/rod attachment bracket/mounting nut missing (2.4.g.1) 03 September 2009 [12:56] 03/09/2009 742336649206 742336649206
1 Offside rear mechanical brake component securing device missing (3.5.1i) Offside rear mechanical brake component securing device missing (3.5.1i) 03 September 2009 [12:56] 03/09/2009 742336649206 742336649206
1 Offside front front brake binding (3.7.b.1) Offside front front brake binding (3.7.b.1) 03 September 2009 [12:56] 03/09/2009 742336649206 742336649206
1 Front front brake application uneven (3.7.b.2) Front front brake application uneven (3.7.b.2) 03 September 2009 [12:56] 03/09/2009 742336649206 742336649206

ALL 504 XUX User Entered Faults [3]

ALL User Entered faults, ORDERED by OCCURRENCE DURING 504 XUX's MOT HISTORY
ALL 504 XUX User Entered Faults [3]
ALL User Entered faults, ORDERED by OCCURRENCE DURING 504 XUX's MOT HISTORY
User Entered Faults | source www.vehiclestats.co.uk
Fault Fault Test Date Test Date/Time Reference MOT Test Reference
2 Vehicle has had extensive welding repairs carried out. (repairs at time of test appear to be satisfactory) also vehicle has had heavy underseal applied Vehicle has had extensive welding repairs carried out. (repairs at time of test appear to be satisfactory) also vehicle has had heavy underseal applied 08 September 2009 [08:31] 08/09/2009 03 September 2009 [12:56] 03/09/2009 801031359222 801031359222 742336649206 742336649206
1 Slight corrosion on o/s upper chassis Slight corrosion on o/s upper chassis 09 August 2010 [10:27] 09/08/2010 720171320247 720171320247

ALL 504 XUX Pass With Rectification Faults [1]

ALL Pass With Rectification faults, ORDERED by OCCURRENCE DURING 504 XUX's MOT HISTORY
ALL 504 XUX Pass With Rectification Faults [1]
ALL Pass With Rectification faults, ORDERED by OCCURRENCE DURING 504 XUX's MOT HISTORY
Pass With Rectification Faults | source www.vehiclestats.co.uk
Fault Fault Test Date Test Date/Time Reference MOT Test Reference
1 Nearside headlamp not working on dipped beam (1.7.5a) Nearside headlamp not working on dipped beam (1.7.5a) 12 August 2011 [10:50] 12/08/2011 688984721234 688984721234

MOT TEST: 10 July 2017 14:55:42 PASSED
MOT TEST: 10 July 2017 14:55:42 PASSED

This test (402945313881) was completed on the 10 July 2017 14:55:42 and PASSED the requirements for a valid MOT with 0 comments.

This test (402945313881) was completed on the 10 July 2017 14:55:42 and PASSED the requirements for a valid MOT with 0 comments.

Recorded mileage: 54,957

Recorded mileage: 54,957


MOT TEST: 10 July 2017 09:18:21 FAILED
MOT TEST: 10 July 2017 09:18:21 FAILED

This test (520189675935) was completed on the 10 July 2017 09:18:21 and FAILED the requirements for a valid MOT with 2 comments.

This test (520189675935) was completed on the 10 July 2017 09:18:21 and FAILED the requirements for a valid MOT with 2 comments.

Recorded mileage: 54,951

Recorded mileage: 54,951


FAIL


MOT TEST: 12 July 2016 13:56:44 PASSED
MOT TEST: 12 July 2016 13:56:44 PASSED

This test (645096275530) was completed on the 12 July 2016 13:56:44 and PASSED the requirements for a valid MOT with 0 comments.

This test (645096275530) was completed on the 12 July 2016 13:56:44 and PASSED the requirements for a valid MOT with 0 comments.

Recorded mileage: 54,169

Recorded mileage: 54,169


MOT TEST: 11 July 2016 13:43:40 FAILED
MOT TEST: 11 July 2016 13:43:40 FAILED

This test (403189103319) was completed on the 11 July 2016 13:43:40 and FAILED the requirements for a valid MOT with 1 comments.

This test (403189103319) was completed on the 11 July 2016 13:43:40 and FAILED the requirements for a valid MOT with 1 comments.

Recorded mileage: 54,163

Recorded mileage: 54,163


FAIL


MOT TEST: 11 July 2015 10:17:08 PASSED
MOT TEST: 11 July 2015 10:17:08 PASSED

This test (259532495499) was completed on the 11 July 2015 10:17:08 and PASSED the requirements for a valid MOT with 2 comments.

This test (259532495499) was completed on the 11 July 2015 10:17:08 and PASSED the requirements for a valid MOT with 2 comments.

Recorded mileage: 53,659

Recorded mileage: 53,659


ADVISORY


MOT TEST: 08 July 2014 10:49:57 PASSED
MOT TEST: 08 July 2014 10:49:57 PASSED

This test (439409784136) was completed on the 08 July 2014 10:49:57 and PASSED the requirements for a valid MOT with 2 comments.

This test (439409784136) was completed on the 08 July 2014 10:49:57 and PASSED the requirements for a valid MOT with 2 comments.

Recorded mileage: 53,332

Recorded mileage: 53,332


ADVISORY


MOT TEST: 07 August 2013 09:48:00 PASSED
MOT TEST: 07 August 2013 09:48:00 PASSED

This test (687829613206) was completed on the 07 August 2013 09:48:00 and PASSED the requirements for a valid MOT with 0 comments.

This test (687829613206) was completed on the 07 August 2013 09:48:00 and PASSED the requirements for a valid MOT with 0 comments.

Recorded mileage: 52,875

Recorded mileage: 52,875


MOT TEST: 08 August 2012 09:36:24 PASSED
MOT TEST: 08 August 2012 09:36:24 PASSED

This test (636061322267) was completed on the 08 August 2012 09:36:24 and PASSED the requirements for a valid MOT with 0 comments.

This test (636061322267) was completed on the 08 August 2012 09:36:24 and PASSED the requirements for a valid MOT with 0 comments.

Recorded mileage: 52,084

Recorded mileage: 52,084


MOT TEST: 12 August 2011 10:50:47 PASSED
MOT TEST: 12 August 2011 10:50:47 PASSED

This test (476124521282) was completed on the 12 August 2011 10:50:47 and PASSED the requirements for a valid MOT with 0 comments.

This test (476124521282) was completed on the 12 August 2011 10:50:47 and PASSED the requirements for a valid MOT with 0 comments.

Recorded mileage: 51,500

Recorded mileage: 51,500


MOT TEST: 12 August 2011 10:50:47 FAILED
MOT TEST: 12 August 2011 10:50:47 FAILED

This test (688984721234) was completed on the 12 August 2011 10:50:47 and FAILED the requirements for a valid MOT with 1 comments.

This test (688984721234) was completed on the 12 August 2011 10:50:47 and FAILED the requirements for a valid MOT with 1 comments.

Recorded mileage: 51,500

Recorded mileage: 51,500


PASS WITH RECTIFICATION


MOT TEST: 09 August 2010 10:27:13 PASSED
MOT TEST: 09 August 2010 10:27:13 PASSED

This test (720171320247) was completed on the 09 August 2010 10:27:13 and PASSED the requirements for a valid MOT with 3 comments.

This test (720171320247) was completed on the 09 August 2010 10:27:13 and PASSED the requirements for a valid MOT with 3 comments.

Recorded mileage: 51,082

Recorded mileage: 51,082


ADVISORY

USER ENTERED


MOT TEST: 08 September 2009 08:31:54 PASSED
MOT TEST: 08 September 2009 08:31:54 PASSED

This test (801031359222) was completed on the 08 September 2009 08:31:54 and PASSED the requirements for a valid MOT with 1 comments.

This test (801031359222) was completed on the 08 September 2009 08:31:54 and PASSED the requirements for a valid MOT with 1 comments.

Recorded mileage: 51,097

Recorded mileage: 51,097


USER ENTERED


MOT TEST: 03 September 2009 12:56:05 FAILED
MOT TEST: 03 September 2009 12:56:05 FAILED

This test (742336649206) was completed on the 03 September 2009 12:56:05 and FAILED the requirements for a valid MOT with 7 comments.

This test (742336649206) was completed on the 03 September 2009 12:56:05 and FAILED the requirements for a valid MOT with 7 comments.

Recorded mileage: 51,099

Recorded mileage: 51,099


FAIL

USER ENTERED


MOT TEST: 21 August 2007 13:27:12 PASSED
MOT TEST: 21 August 2007 13:27:12 PASSED

This test (370123737427) was completed on the 21 August 2007 13:27:12 and PASSED the requirements for a valid MOT with 0 comments.

This test (370123737427) was completed on the 21 August 2007 13:27:12 and PASSED the requirements for a valid MOT with 0 comments.

Recorded mileage: 51,099

Recorded mileage: 51,099