507 YUS


507YUS is registered to a White 1959, Morris Minor with a Petrol engine. It Passed its most recent MOT Test on the 19 February 2019

20 unique faults (21 Total) reported in its MOT History (7 Tests).

1 common/recurring faults.

57% (4) MOT Pass Rate and a 43% (3) MOT Failure Rate.

16,965 recorded miles.

507 YUS


507YUS is registered to a White 1959, Morris Minor with a Petrol engine. It Passed its most recent MOT Test on the 19 February 2019

20 unique faults (21 Total) reported in its MOT History (7 Tests).

1 common/recurring faults.

57% (4) MOT Pass Rate and a 43% (3) MOT Failure Rate.

16,965 recorded miles.

MOT PASS/Failure rate for 507 YUS

all MOT test results for 507 YUS represented as a percentage
MOT PASS/Failure rate for 507 YUS
all MOT test results for 507 YUS represented as a percentage

PERCENTAGE OF VEHICLE FAULTS WITH 507 YUS

ALL REPORTED FAULTS, DISPLAYED BY PERCENTAGE OF OCCURRENCE DURING ALL MOT TESTS
PERCENTAGE OF VEHICLE FAULTS WITH 507 YUS
ALL REPORTED FAULTS, DISPLAYED BY PERCENTAGE OF OCCURRENCE DURING ALL MOT TESTS
ADVISORY

FAIL

USER ENTERED

507 YUS annual Faults by type

ALL REPORTED FAULTS, DISPLAYED over time and categorised by type
507 YUS annual Faults by type
ALL REPORTED FAULTS, DISPLAYED over time and categorised by type

ALL 507 YUS ADVISORIES [2]

ALL ADVISORIES, ORDERED by OCCURRENCE DURING 507 YUS's MOT HISTORY
ALL 507 YUS ADVISORIES [2]
ALL ADVISORIES, ORDERED by OCCURRENCE DURING 507 YUS's MOT HISTORY
Advisory Faults | source www.vehiclestats.co.uk
Fault Fault Test Date Test Date/Time Reference MOT Test Reference
2 Offside front lower axle swivel joint has slight play (2.5.a.3b) Offside front lower axle swivel joint has slight play (2.5.a.3b) 20 September 2012 [17:46] 20/09/2012 20 September 2012 [13:58] 20/09/2012 686664862206 686664862206 315134662496 315134662496

ALL 507 YUS Failure Faults [18]

ALL Failure faults, ORDERED by OCCURRENCE DURING 507 YUS's MOT HISTORY
ALL 507 YUS Failure Faults [18]
ALL Failure faults, ORDERED by OCCURRENCE DURING 507 YUS's MOT HISTORY
Fail Faults | source www.vehiclestats.co.uk
Fault Fault Test Date Test Date/Time Reference MOT Test Reference
1 Steering wheel rim fractured (2.2.1 (c) (i)) Steering wheel rim fractured (2.2.1 (c) (i)) 10 August 2018 [11:18] 10/08/2018 589707012142 589707012142
1 Offside front steering linkage likely to become detached track rod end (2.1.3 (a) (ii)) Offside front steering linkage likely to become detached track rod end (2.1.3 (a) (ii)) 10 August 2018 [11:18] 10/08/2018 589707012142 589707012142
1 Nearside front tyre has ply or cords exposed (5.2.3 (d) (ii)) Nearside front tyre has ply or cords exposed (5.2.3 (d) (ii)) 10 August 2018 [11:18] 10/08/2018 589707012142 589707012142
1 Nearside rear tyre has ply or cords exposed (5.2.3 (d) (ii)) Nearside rear tyre has ply or cords exposed (5.2.3 (d) (ii)) 10 August 2018 [11:18] 10/08/2018 589707012142 589707012142
1 Offside front tyre has ply or cords exposed (5.2.3 (d) (ii)) Offside front tyre has ply or cords exposed (5.2.3 (d) (ii)) 10 August 2018 [11:18] 10/08/2018 589707012142 589707012142
1 Offside rear tyre has ply or cords exposed (5.2.3 (d) (ii)) Offside rear tyre has ply or cords exposed (5.2.3 (d) (ii)) 10 August 2018 [11:18] 10/08/2018 589707012142 589707012142
1 Central exhaust system insecure (6.1.2 (a)) Central exhaust system insecure (6.1.2 (a)) 10 August 2018 [11:18] 10/08/2018 589707012142 589707012142
1 Windscreen washer provides insufficient washer liquid (3.5 (a)) Windscreen washer provides insufficient washer liquid (3.5 (a)) 10 August 2018 [11:18] 10/08/2018 589707012142 589707012142
1 Nearside rear braking system leaking (1.1.3 (d)) Nearside rear braking system leaking (1.1.3 (d)) 10 August 2018 [11:18] 10/08/2018 589707012142 589707012142
1 Nearside parking brake inoperative on one side (1.4.1 (a)) Nearside parking brake inoperative on one side (1.4.1 (a)) 10 August 2018 [11:18] 10/08/2018 589707012142 589707012142
1 Nearside brakes imbalanced across an axle (1.2.1 (b) (i)) Nearside brakes imbalanced across an axle (1.2.1 (b) (i)) 10 August 2018 [11:18] 10/08/2018 589707012142 589707012142
1 Nearside front position lamp not working (4.2.1 (a)) Nearside front position lamp not working (4.2.1 (a)) 10 August 2018 [11:18] 10/08/2018 589707012142 589707012142
1 Parking brake efficiency below requirements (1.4.2 (a) (i)) Parking brake efficiency below requirements (1.4.2 (a) (i)) 10 August 2018 [11:18] 10/08/2018 589707012142 589707012142
1 Rear brakes imbalanced across an axle axle 2 (1.2.1 (b) (i)) Rear brakes imbalanced across an axle axle 2 (1.2.1 (b) (i)) 10 August 2018 [11:18] 10/08/2018 589707012142 589707012142
1 Parking (secondary brake) on a single line braking system imbalanced across an axle axle 1 (1.3.1 (b) (i)) Parking (secondary brake) on a single line braking system imbalanced across an axle axle 1 (1.3.1 (b) (i)) 10 August 2018 [11:18] 10/08/2018 589707012142 589707012142
1 Nearside rear tyre(s) incorrect because different size tyres are fitted on the same axle. (4.1.a.1a) Nearside rear tyre(s) incorrect because different size tyres are fitted on the same axle. (4.1.a.1a) 18 September 2014 [11:44] 18/09/2014 117481064248 117481064248
1 Direction indicators not working (1.4.a.2c) Direction indicators not working (1.4.a.2c) 18 September 2014 [11:44] 18/09/2014 117481064248 117481064248
1 Rear tyre(s) incorrect because different size tyres are fitted on the same axle. (4.1.a.1a) Rear tyre(s) incorrect because different size tyres are fitted on the same axle. (4.1.a.1a) 20 September 2012 [13:58] 20/09/2012 315134662496 315134662496

ALL 507 YUS User Entered Faults [1]

ALL User Entered faults, ORDERED by OCCURRENCE DURING 507 YUS's MOT HISTORY
ALL 507 YUS User Entered Faults [1]
ALL User Entered faults, ORDERED by OCCURRENCE DURING 507 YUS's MOT HISTORY
Fail Faults | source www.vehiclestats.co.uk
Fault Fault Test Date Test Date/Time Reference MOT Test Reference
1 Cut in nearside front tyre Cut in nearside front tyre 18 September 2014 [11:44] 18/09/2014 117481064248 117481064248

MOT TEST: 19 February 2019 14:53:40 PASSED
MOT TEST: 19 February 2019 14:53:40 PASSED

This test (856801760319) was completed on the 19 February 2019 14:53:40 and PASSED the requirements for a valid MOT with 0 comments.

This test (856801760319) was completed on the 19 February 2019 14:53:40 and PASSED the requirements for a valid MOT with 0 comments.

Recorded mileage: 16,965

Recorded mileage: 16,965


MOT TEST: 06 September 2018 07:56:22 PASSED
MOT TEST: 06 September 2018 07:56:22 PASSED

This test (518806855121) was completed on the 06 September 2018 07:56:22 and PASSED the requirements for a valid MOT with 0 comments.

This test (518806855121) was completed on the 06 September 2018 07:56:22 and PASSED the requirements for a valid MOT with 0 comments.

Recorded mileage: 16,882

Recorded mileage: 16,882


MOT TEST: 10 August 2018 11:18:19 FAILED
MOT TEST: 10 August 2018 11:18:19 FAILED

This test (589707012142) was completed on the 10 August 2018 11:18:19 and FAILED the requirements for a valid MOT with 15 comments.

This test (589707012142) was completed on the 10 August 2018 11:18:19 and FAILED the requirements for a valid MOT with 15 comments.

Recorded mileage: 16,866

Recorded mileage: 16,866


FAIL


MOT TEST: 18 September 2014 15:53:10 PASSED
MOT TEST: 18 September 2014 15:53:10 PASSED

This test (955111864293) was completed on the 18 September 2014 15:53:10 and PASSED the requirements for a valid MOT with 0 comments.

This test (955111864293) was completed on the 18 September 2014 15:53:10 and PASSED the requirements for a valid MOT with 0 comments.

Recorded mileage: 15,384

Recorded mileage: 15,384


MOT TEST: 18 September 2014 11:44:38 FAILED
MOT TEST: 18 September 2014 11:44:38 FAILED

This test (117481064248) was completed on the 18 September 2014 11:44:38 and FAILED the requirements for a valid MOT with 3 comments.

This test (117481064248) was completed on the 18 September 2014 11:44:38 and FAILED the requirements for a valid MOT with 3 comments.

Recorded mileage: 15,371

Recorded mileage: 15,371


FAIL

USER ENTERED


MOT TEST: 20 September 2012 17:46:32 PASSED
MOT TEST: 20 September 2012 17:46:32 PASSED

This test (686664862206) was completed on the 20 September 2012 17:46:32 and PASSED the requirements for a valid MOT with 1 comments.

This test (686664862206) was completed on the 20 September 2012 17:46:32 and PASSED the requirements for a valid MOT with 1 comments.

Recorded mileage: 15,204

Recorded mileage: 15,204


ADVISORY


MOT TEST: 20 September 2012 13:58:59 FAILED
MOT TEST: 20 September 2012 13:58:59 FAILED

This test (315134662496) was completed on the 20 September 2012 13:58:59 and FAILED the requirements for a valid MOT with 2 comments.

This test (315134662496) was completed on the 20 September 2012 13:58:59 and FAILED the requirements for a valid MOT with 2 comments.

Recorded mileage: 15,204

Recorded mileage: 15,204


ADVISORY

FAIL