513 UYF


513UYF is registered to a Grey 1954, Morris Minor with a Petrol engine. It Failed its most recent MOT Test on the 05 January 2018

20 unique faults (20 Total) reported in its MOT History (17 Tests).

0 common/recurring faults.

65% (11) MOT Pass Rate and a 35% (6) MOT Failure Rate.

51,222 recorded miles.

513 UYF


513UYF is registered to a Grey 1954, Morris Minor with a Petrol engine. It Failed its most recent MOT Test on the 05 January 2018

20 unique faults (20 Total) reported in its MOT History (17 Tests).

0 common/recurring faults.

65% (11) MOT Pass Rate and a 35% (6) MOT Failure Rate.

51,222 recorded miles.

MOT PASS/Failure rate for 513 UYF

all MOT test results for 513 UYF represented as a percentage
MOT PASS/Failure rate for 513 UYF
all MOT test results for 513 UYF represented as a percentage

PERCENTAGE OF VEHICLE FAULTS WITH 513 UYF

ALL REPORTED FAULTS, DISPLAYED BY PERCENTAGE OF OCCURRENCE DURING ALL MOT TESTS
PERCENTAGE OF VEHICLE FAULTS WITH 513 UYF
ALL REPORTED FAULTS, DISPLAYED BY PERCENTAGE OF OCCURRENCE DURING ALL MOT TESTS
FAIL

USER ENTERED

513 UYF annual Faults by type

ALL REPORTED FAULTS, DISPLAYED over time and categorised by type
513 UYF annual Faults by type
ALL REPORTED FAULTS, DISPLAYED over time and categorised by type

ALL 513 UYF Failure Faults [19]

ALL Failure faults, ORDERED by OCCURRENCE DURING 513 UYF's MOT HISTORY
ALL 513 UYF Failure Faults [19]
ALL Failure faults, ORDERED by OCCURRENCE DURING 513 UYF's MOT HISTORY
Fail Faults | source www.vehiclestats.co.uk
Fault Fault Test Date Test Date/Time Reference MOT Test Reference
1 Parking brake: efficiency below requirements (3.7.c.1b) Parking brake: efficiency below requirements (3.7.c.1b) 06 February 2014 [14:52] 06/02/2014 486137334076 486137334076
1 Nearside rear brake recording little or no effort (3.7.b.5a) Nearside rear brake recording little or no effort (3.7.b.5a) 06 February 2014 [14:52] 06/02/2014 486137334076 486137334076
1 Nearside rear parking brake recording little or no effort (3.7.b.6a) Nearside rear parking brake recording little or no effort (3.7.b.6a) 06 February 2014 [14:52] 06/02/2014 486137334076 486137334076
1 Windscreen wiper not operating automatically when switched on (8.2.1b) Windscreen wiper not operating automatically when switched on (8.2.1b) 21 November 2011 [10:51] 21/11/2011 408865421385 408865421385
1 Nearside rear brake drum contaminated by oil (3.5.1h) Nearside rear brake drum contaminated by oil (3.5.1h) 21 November 2011 [10:51] 21/11/2011 408865421385 408865421385
1 Offside rear brake drum contaminated by oil (3.5.1h) Offside rear brake drum contaminated by oil (3.5.1h) 21 November 2011 [10:51] 21/11/2011 408865421385 408865421385
1 Nearside front torsion bar attachment bracket corroded and seriously weakened (2.4.e.4c) Nearside front torsion bar attachment bracket corroded and seriously weakened (2.4.e.4c) 19 January 2011 [11:11] 19/01/2011 749089511073 749089511073
1 Nearside rear suspension spring mounting prescribed area is excessively corroded (2.4.a.3) Nearside rear suspension spring mounting prescribed area is excessively corroded (2.4.a.3) 19 January 2011 [11:11] 19/01/2011 749089511073 749089511073
1 Offside rear suspension spring mounting prescribed area is excessively corroded (2.4.a.3) Offside rear suspension spring mounting prescribed area is excessively corroded (2.4.a.3) 19 January 2011 [11:11] 19/01/2011 749089511073 749089511073
1 Nearside front suspension component mounting prescribed area is excessively corroded (2.4.a.3) Nearside front suspension component mounting prescribed area is excessively corroded (2.4.a.3) 17 September 2009 [10:54] 17/09/2009 901420069270 901420069270
1 Offside front suspension component mounting prescribed area is excessively corroded (2.4.a.3) Offside front suspension component mounting prescribed area is excessively corroded (2.4.a.3) 17 September 2009 [10:54] 17/09/2009 901420069270 901420069270
1 Brakes imbalanced across an axle (3.7.b.5b) Brakes imbalanced across an axle (3.7.b.5b) 17 September 2009 [10:54] 17/09/2009 901420069270 901420069270
1 Offside headlamp not working on main beam (1.7.5a) Offside headlamp not working on main beam (1.7.5a) 05 September 2008 [09:42] 05/09/2008 283139448279 283139448279
1 Nearside rear position lamp(s) excessively deteriorated so that it is not visible from a reasonable distance (1.1.a.3d) Nearside rear position lamp(s) excessively deteriorated so that it is not visible from a reasonable distance (1.1.a.3d) 05 September 2008 [09:42] 05/09/2008 283139448279 283139448279
1 Nearside front front brake binding (3.7.b.1) Nearside front front brake binding (3.7.b.1) 05 September 2008 [09:42] 05/09/2008 283139448279 283139448279
1 Offside windscreen wiper blade insecure (8.2.2) Offside windscreen wiper blade insecure (8.2.2) 05 September 2008 [09:42] 05/09/2008 283139448279 283139448279
1 Offside rear braking system leaking (3.6.a.1) Offside rear braking system leaking (3.6.a.1) 05 September 2008 [09:42] 05/09/2008 283139448279 283139448279
1 Nearside suspension component mounting prescribed area is excessively corroded (2.4.a.3) Nearside suspension component mounting prescribed area is excessively corroded (2.4.a.3) 20 December 2005 [09:14] 20/12/2005 850974055342 850974055342
1 Nearside rear rear brake recording little or no effort (3.7.b.5a) Nearside rear rear brake recording little or no effort (3.7.b.5a) 20 December 2005 [09:14] 20/12/2005 850974055342 850974055342

ALL 513 UYF User Entered Faults [1]

ALL User Entered faults, ORDERED by OCCURRENCE DURING 513 UYF's MOT HISTORY
ALL 513 UYF User Entered Faults [1]
ALL User Entered faults, ORDERED by OCCURRENCE DURING 513 UYF's MOT HISTORY
User Entered Faults | source www.vehiclestats.co.uk
Fault Fault Test Date Test Date/Time Reference MOT Test Reference
1 Battery insecure Battery insecure 28 August 2007 [16:25] 28/08/2007 232600347243 232600347243

MOT TEST: 05 January 2018 09:28:48 PASSED
MOT TEST: 05 January 2018 09:28:48 PASSED

This test (928864437692) was completed on the 05 January 2018 09:28:48 and PASSED the requirements for a valid MOT with 0 comments.

This test (928864437692) was completed on the 05 January 2018 09:28:48 and PASSED the requirements for a valid MOT with 0 comments.

Recorded mileage: 51,222

Recorded mileage: 51,222


MOT TEST: 11 November 2016 11:05:18 PASSED
MOT TEST: 11 November 2016 11:05:18 PASSED

This test (108576070170) was completed on the 11 November 2016 11:05:18 and PASSED the requirements for a valid MOT with 0 comments.

This test (108576070170) was completed on the 11 November 2016 11:05:18 and PASSED the requirements for a valid MOT with 0 comments.

Recorded mileage: 50,868

Recorded mileage: 50,868


MOT TEST: 09 October 2015 14:04:35 PASSED
MOT TEST: 09 October 2015 14:04:35 PASSED

This test (244048259154) was completed on the 09 October 2015 14:04:35 and PASSED the requirements for a valid MOT with 0 comments.

This test (244048259154) was completed on the 09 October 2015 14:04:35 and PASSED the requirements for a valid MOT with 0 comments.

Recorded mileage: 47,765

Recorded mileage: 47,765


MOT TEST: 26 September 2014 15:49:41 PASSED
MOT TEST: 26 September 2014 15:49:41 PASSED

This test (679469464227) was completed on the 26 September 2014 15:49:41 and PASSED the requirements for a valid MOT with 0 comments.

This test (679469464227) was completed on the 26 September 2014 15:49:41 and PASSED the requirements for a valid MOT with 0 comments.

Recorded mileage: 47,256

Recorded mileage: 47,256


MOT TEST: 10 February 2014 13:26:50 PASSED
MOT TEST: 10 February 2014 13:26:50 PASSED

This test (169421644036) was completed on the 10 February 2014 13:26:50 and PASSED the requirements for a valid MOT with 0 comments.

This test (169421644036) was completed on the 10 February 2014 13:26:50 and PASSED the requirements for a valid MOT with 0 comments.

Recorded mileage: 46,981

Recorded mileage: 46,981


MOT TEST: 06 February 2014 14:52:23 FAILED
MOT TEST: 06 February 2014 14:52:23 FAILED

This test (486137334076) was completed on the 06 February 2014 14:52:23 and FAILED the requirements for a valid MOT with 3 comments.

This test (486137334076) was completed on the 06 February 2014 14:52:23 and FAILED the requirements for a valid MOT with 3 comments.

Recorded mileage: 46,968

Recorded mileage: 46,968


FAIL


MOT TEST: 21 November 2011 16:54:17 PASSED
MOT TEST: 21 November 2011 16:54:17 PASSED

This test (358595321339) was completed on the 21 November 2011 16:54:17 and PASSED the requirements for a valid MOT with 0 comments.

This test (358595321339) was completed on the 21 November 2011 16:54:17 and PASSED the requirements for a valid MOT with 0 comments.

Recorded mileage: 46,933

Recorded mileage: 46,933


MOT TEST: 21 November 2011 10:51:05 FAILED
MOT TEST: 21 November 2011 10:51:05 FAILED

This test (408865421385) was completed on the 21 November 2011 10:51:05 and FAILED the requirements for a valid MOT with 3 comments.

This test (408865421385) was completed on the 21 November 2011 10:51:05 and FAILED the requirements for a valid MOT with 3 comments.

Recorded mileage: 46,926

Recorded mileage: 46,926


FAIL


MOT TEST: 21 January 2011 11:34:38 PASSED
MOT TEST: 21 January 2011 11:34:38 PASSED

This test (129931721454) was completed on the 21 January 2011 11:34:38 and PASSED the requirements for a valid MOT with 0 comments.

This test (129931721454) was completed on the 21 January 2011 11:34:38 and PASSED the requirements for a valid MOT with 0 comments.

Recorded mileage: 46,717

Recorded mileage: 46,717


MOT TEST: 19 January 2011 11:11:57 FAILED
MOT TEST: 19 January 2011 11:11:57 FAILED

This test (749089511073) was completed on the 19 January 2011 11:11:57 and FAILED the requirements for a valid MOT with 3 comments.

This test (749089511073) was completed on the 19 January 2011 11:11:57 and FAILED the requirements for a valid MOT with 3 comments.

Recorded mileage: 46,710

Recorded mileage: 46,710


FAIL


MOT TEST: 17 September 2009 14:46:16 PASSED
MOT TEST: 17 September 2009 14:46:16 PASSED

This test (921280969299) was completed on the 17 September 2009 14:46:16 and PASSED the requirements for a valid MOT with 0 comments.

This test (921280969299) was completed on the 17 September 2009 14:46:16 and PASSED the requirements for a valid MOT with 0 comments.

Recorded mileage: 46,701

Recorded mileage: 46,701


MOT TEST: 17 September 2009 10:54:02 FAILED
MOT TEST: 17 September 2009 10:54:02 FAILED

This test (901420069270) was completed on the 17 September 2009 10:54:02 and FAILED the requirements for a valid MOT with 3 comments.

This test (901420069270) was completed on the 17 September 2009 10:54:02 and FAILED the requirements for a valid MOT with 3 comments.

Recorded mileage: 46,694

Recorded mileage: 46,694


FAIL


MOT TEST: 11 September 2008 15:46:08 PASSED
MOT TEST: 11 September 2008 15:46:08 PASSED

This test (660455258212) was completed on the 11 September 2008 15:46:08 and PASSED the requirements for a valid MOT with 0 comments.

This test (660455258212) was completed on the 11 September 2008 15:46:08 and PASSED the requirements for a valid MOT with 0 comments.

Recorded mileage: 46,380

Recorded mileage: 46,380


MOT TEST: 05 September 2008 09:42:27 FAILED
MOT TEST: 05 September 2008 09:42:27 FAILED

This test (283139448279) was completed on the 05 September 2008 09:42:27 and FAILED the requirements for a valid MOT with 5 comments.

This test (283139448279) was completed on the 05 September 2008 09:42:27 and FAILED the requirements for a valid MOT with 5 comments.

Recorded mileage: 46,373

Recorded mileage: 46,373


FAIL


MOT TEST: 28 August 2007 16:25:11 PASSED
MOT TEST: 28 August 2007 16:25:11 PASSED

This test (232600347243) was completed on the 28 August 2007 16:25:11 and PASSED the requirements for a valid MOT with 1 comments.

This test (232600347243) was completed on the 28 August 2007 16:25:11 and PASSED the requirements for a valid MOT with 1 comments.

Recorded mileage: 46,216

Recorded mileage: 46,216


USER ENTERED


MOT TEST: 06 February 2006 09:30:58 PASSED
MOT TEST: 06 February 2006 09:30:58 PASSED

This test (110077836436) was completed on the 06 February 2006 09:30:58 and PASSED the requirements for a valid MOT with 0 comments.

This test (110077836436) was completed on the 06 February 2006 09:30:58 and PASSED the requirements for a valid MOT with 0 comments.

Recorded mileage: 45,899

Recorded mileage: 45,899


MOT TEST: 20 December 2005 09:14:11 FAILED
MOT TEST: 20 December 2005 09:14:11 FAILED

This test (850974055342) was completed on the 20 December 2005 09:14:11 and FAILED the requirements for a valid MOT with 2 comments.

This test (850974055342) was completed on the 20 December 2005 09:14:11 and FAILED the requirements for a valid MOT with 2 comments.

Recorded mileage: 45,841

Recorded mileage: 45,841


FAIL