52LMM


52LMM is registered to a Black 1957, Morris Minor traveller with a Petrol engine. It Failed its most recent MOT Test on the 07 May 2015

31 unique faults (35 Total) reported in its MOT History (6 Tests).

3 common/recurring faults, the most frequent (3 times) is: Offside Suspension arm has slight play in a ball joint (2.4.G.2).

33% (2) MOT Pass Rate and a 67% (4) MOT Failure Rate.

42,257 recorded miles.

52LMM


52LMM is registered to a Black 1957, Morris Minor traveller with a Petrol engine. It Failed its most recent MOT Test on the 07 May 2015

31 unique faults (35 Total) reported in its MOT History (6 Tests).

3 common/recurring faults, the most frequent (3 times) is: Offside Suspension arm has slight play in a ball joint (2.4.G.2).

33% (2) MOT Pass Rate and a 67% (4) MOT Failure Rate.

42,257 recorded miles.

MOT PASS/Failure rate for 52LMM

all MOT test results for 52LMM represented as a percentage
MOT PASS/Failure rate for 52LMM
all MOT test results for 52LMM represented as a percentage

PERCENTAGE OF VEHICLE FAULTS WITH 52LMM

ALL REPORTED FAULTS, DISPLAYED BY PERCENTAGE OF OCCURRENCE DURING ALL MOT TESTS
PERCENTAGE OF VEHICLE FAULTS WITH 52LMM
ALL REPORTED FAULTS, DISPLAYED BY PERCENTAGE OF OCCURRENCE DURING ALL MOT TESTS
ADVISORY

FAIL

USER ENTERED

52LMM annual Faults by type

ALL REPORTED FAULTS, DISPLAYED over time and categorised by type
52LMM annual Faults by type
ALL REPORTED FAULTS, DISPLAYED over time and categorised by type

RECURRING FAULTS WITH 52LMM

FAULTS THAT HAVE OCCURED MORE THAN ONCE DURING 52LMM's MOT HISTORY
RECURRING FAULTS WITH 52LMM
FAULTS THAT HAVE OCCURED MORE THAN ONCE DURING 52LMM's MOT HISTORY
Fault Fault Test Date Test Date/Time Reference MOT Test Reference
3 Offside suspension arm has slight play in a ball joint (2.4.g.2) Offside suspension arm has slight play in a ball joint (2.4.g.2) 16 August 2013 [11:27] 16/08/2013 15 August 2013 [14:03] 15/08/2013 19 June 2013 [11:21] 19/06/2013 367508023260 367508023260 578147123226 578147123226 185520373170 185520373170
2 Water leak Water leak 07 May 2015 [13:45] 07/05/2015 06 May 2015 [15:56] 06/05/2015 455107325172 455107325172 809256925156 809256925156
2 Brakes imbalanced across an axle (3.7.b.5b) Brakes imbalanced across an axle (3.7.b.5b) 06 May 2015 [15:56] 06/05/2015 15 August 2013 [14:03] 15/08/2013 809256925156 809256925156 578147123226 578147123226

ALL 52LMM ADVISORIES [4]

ALL ADVISORIES, ORDERED by OCCURRENCE DURING 52LMM's MOT HISTORY
ALL 52LMM ADVISORIES [4]
ALL ADVISORIES, ORDERED by OCCURRENCE DURING 52LMM's MOT HISTORY
Advisory Faults | source www.vehiclestats.co.uk
Fault Fault Test Date Test Date/Time Reference MOT Test Reference
3 Offside suspension arm has slight play in a ball joint (2.4.g.2) Offside suspension arm has slight play in a ball joint (2.4.g.2) 16 August 2013 [11:27] 16/08/2013 15 August 2013 [14:03] 15/08/2013 19 June 2013 [11:21] 19/06/2013 367508023260 367508023260 578147123226 578147123226 185520373170 185520373170
1 Nearside front tyre worn close to the legal limit (4.1.e.1) Nearside front tyre worn close to the legal limit (4.1.e.1) 12 March 2012 [16:49] 12/03/2012 728542272012 728542272012

ALL 52LMM Failure Faults [29]

ALL Failure faults, ORDERED by OCCURRENCE DURING 52LMM's MOT HISTORY
ALL 52LMM Failure Faults [29]
ALL Failure faults, ORDERED by OCCURRENCE DURING 52LMM's MOT HISTORY
Fail Faults | source www.vehiclestats.co.uk
Fault Fault Test Date Test Date/Time Reference MOT Test Reference
2 Brakes imbalanced across an axle (3.7.b.5b) Brakes imbalanced across an axle (3.7.b.5b) 06 May 2015 [15:56] 06/05/2015 15 August 2013 [14:03] 15/08/2013 809256925156 809256925156 578147123226 578147123226
1 Offside front position lamp(s) adversely affected by the operation of another lamp (1.1.a.3f) Offside front position lamp(s) adversely affected by the operation of another lamp (1.1.a.3f) 06 May 2015 [15:56] 06/05/2015 809256925156 809256925156
1 Nearside rear position lamp(s) not working (1.1.a.3b) Nearside rear position lamp(s) not working (1.1.a.3b) 06 May 2015 [15:56] 06/05/2015 809256925156 809256925156
1 Offside rear position lamp(s) not working (1.1.a.3b) Offside rear position lamp(s) not working (1.1.a.3b) 06 May 2015 [15:56] 06/05/2015 809256925156 809256925156
1 Registration plate lamp not working (1.1.c.1d) Registration plate lamp not working (1.1.c.1d) 06 May 2015 [15:56] 06/05/2015 809256925156 809256925156
1 Offside front direction indicator not working (1.4.a.2c) Offside front direction indicator not working (1.4.a.2c) 06 May 2015 [15:56] 06/05/2015 809256925156 809256925156
1 Nearside front direction indicator not working (1.4.a.2c) Nearside front direction indicator not working (1.4.a.2c) 06 May 2015 [15:56] 06/05/2015 809256925156 809256925156
1 All position lamps not working (1.1.a.3b) All position lamps not working (1.1.a.3b) 19 June 2013 [11:21] 19/06/2013 185520373170 185520373170
1 Nearside headlamp not working on dipped beam (1.7.5a) Nearside headlamp not working on dipped beam (1.7.5a) 19 June 2013 [11:21] 19/06/2013 185520373170 185520373170
1 Offside headlamp not working on dipped beam (1.7.5a) Offside headlamp not working on dipped beam (1.7.5a) 19 June 2013 [11:21] 19/06/2013 185520373170 185520373170
1 Nearside headlamp not working on main beam (1.7.5a) Nearside headlamp not working on main beam (1.7.5a) 19 June 2013 [11:21] 19/06/2013 185520373170 185520373170
1 Offside headlamp not working on main beam (1.7.5a) Offside headlamp not working on main beam (1.7.5a) 19 June 2013 [11:21] 19/06/2013 185520373170 185520373170
1 Direction indicators not working (1.4.a.2c) Direction indicators not working (1.4.a.2c) 19 June 2013 [11:21] 19/06/2013 185520373170 185520373170
1 Offside electrical wiring damaged, likely to cause a short (1.9.2b) Offside electrical wiring damaged, likely to cause a short (1.9.2b) 19 June 2013 [11:21] 19/06/2013 185520373170 185520373170
1 Nearside front suspension component mounting prescribed area is excessively corroded (2.4.a.3) Nearside front suspension component mounting prescribed area is excessively corroded (2.4.a.3) 19 June 2013 [11:21] 19/06/2013 185520373170 185520373170
1 Parking brake: efficiency below requirements (3.7.b.7) Parking brake: efficiency below requirements (3.7.b.7) 19 June 2013 [11:21] 19/06/2013 185520373170 185520373170
1 Exhaust emits dense blue smoke at idle (7.3.a.2b) Exhaust emits dense blue smoke at idle (7.3.a.2b) 19 June 2013 [11:21] 19/06/2013 185520373170 185520373170
1 Front exhaust has a major leak of exhaust gases (7.1.2) Front exhaust has a major leak of exhaust gases (7.1.2) 19 June 2013 [11:21] 19/06/2013 185520373170 185520373170
1 Drivers door cannot be opened from outside the vehicle (6.2.b.1b) Drivers door cannot be opened from outside the vehicle (6.2.b.1b) 19 June 2013 [11:21] 19/06/2013 185520373170 185520373170
1 Offside rear suspension spring mounting prescribed area is excessively corroded (2.4.a.3) Offside rear suspension spring mounting prescribed area is excessively corroded (2.4.a.3) 19 June 2013 [11:21] 19/06/2013 185520373170 185520373170
1 Nearside front brake binding (3.7.b.1) Nearside front brake binding (3.7.b.1) 19 June 2013 [11:21] 19/06/2013 185520373170 185520373170
1 Nearside front front position lamp(s) not working (1.1.a.3b) Nearside front front position lamp(s) not working (1.1.a.3b) 12 March 2012 [16:49] 12/03/2012 728542272012 728542272012
1 Front direction indicators not working (1.4.a.2c) Front direction indicators not working (1.4.a.2c) 12 March 2012 [16:49] 12/03/2012 728542272012 728542272012
1 Rear direction indicators not working (1.4.a.2c) Rear direction indicators not working (1.4.a.2c) 12 March 2012 [16:49] 12/03/2012 728542272012 728542272012
1 Rear stop lamp adversely affected by the operation of another lamp (1.2.1f) Rear stop lamp adversely affected by the operation of another lamp (1.2.1f) 12 March 2012 [16:49] 12/03/2012 728542272012 728542272012
1 Rear body or chassis has excessive corrosion, seriously affecting its strength within 30cm of the body mountings (6.1.b.2) Rear body or chassis has excessive corrosion, seriously affecting its strength within 30cm of the body mountings (6.1.b.2) 12 March 2012 [16:49] 12/03/2012 728542272012 728542272012
1 Nearside front front passenger door cannot be opened from outside the vehicle (6.2.b.1b) Nearside front front passenger door cannot be opened from outside the vehicle (6.2.b.1b) 12 March 2012 [16:49] 12/03/2012 728542272012 728542272012
1 Offside rear wheel cylinder leaking (3.6.a.1) Offside rear wheel cylinder leaking (3.6.a.1) 12 March 2012 [16:49] 12/03/2012 728542272012 728542272012

ALL 52LMM User Entered Faults [2]

ALL User Entered faults, ORDERED by OCCURRENCE DURING 52LMM's MOT HISTORY
ALL 52LMM User Entered Faults [2]
ALL User Entered faults, ORDERED by OCCURRENCE DURING 52LMM's MOT HISTORY
User Entered Faults | source www.vehiclestats.co.uk
Fault Fault Test Date Test Date/Time Reference MOT Test Reference
2 Water leak Water leak 07 May 2015 [13:45] 07/05/2015 06 May 2015 [15:56] 06/05/2015 455107325172 455107325172 809256925156 809256925156

MOT TEST: 07 May 2015 13:45:52 PASSED
MOT TEST: 07 May 2015 13:45:52 PASSED

This test (455107325172) was completed on the 07 May 2015 13:45:52 and PASSED the requirements for a valid MOT with 1 comments.

This test (455107325172) was completed on the 07 May 2015 13:45:52 and PASSED the requirements for a valid MOT with 1 comments.

Recorded mileage: 42,257

Recorded mileage: 42,257


USER ENTERED


MOT TEST: 06 May 2015 15:56:53 FAILED
MOT TEST: 06 May 2015 15:56:53 FAILED

This test (809256925156) was completed on the 06 May 2015 15:56:53 and FAILED the requirements for a valid MOT with 8 comments.

This test (809256925156) was completed on the 06 May 2015 15:56:53 and FAILED the requirements for a valid MOT with 8 comments.

Recorded mileage: 42,257

Recorded mileage: 42,257


FAIL

USER ENTERED


MOT TEST: 16 August 2013 11:27:02 PASSED
MOT TEST: 16 August 2013 11:27:02 PASSED

This test (367508023260) was completed on the 16 August 2013 11:27:02 and PASSED the requirements for a valid MOT with 1 comments.

This test (367508023260) was completed on the 16 August 2013 11:27:02 and PASSED the requirements for a valid MOT with 1 comments.

Recorded mileage: 42,254

Recorded mileage: 42,254


ADVISORY


MOT TEST: 15 August 2013 14:03:04 FAILED
MOT TEST: 15 August 2013 14:03:04 FAILED

This test (578147123226) was completed on the 15 August 2013 14:03:04 and FAILED the requirements for a valid MOT with 2 comments.

This test (578147123226) was completed on the 15 August 2013 14:03:04 and FAILED the requirements for a valid MOT with 2 comments.

Recorded mileage: 42,254

Recorded mileage: 42,254


ADVISORY

FAIL


MOT TEST: 19 June 2013 11:21:40 FAILED
MOT TEST: 19 June 2013 11:21:40 FAILED

This test (185520373170) was completed on the 19 June 2013 11:21:40 and FAILED the requirements for a valid MOT with 15 comments.

This test (185520373170) was completed on the 19 June 2013 11:21:40 and FAILED the requirements for a valid MOT with 15 comments.

Recorded mileage: 42,254

Recorded mileage: 42,254


ADVISORY

FAIL


MOT TEST: 12 March 2012 16:49:48 FAILED
MOT TEST: 12 March 2012 16:49:48 FAILED

This test (728542272012) was completed on the 12 March 2012 16:49:48 and FAILED the requirements for a valid MOT with 8 comments.

This test (728542272012) was completed on the 12 March 2012 16:49:48 and FAILED the requirements for a valid MOT with 8 comments.

Recorded mileage: 42,254

Recorded mileage: 42,254


ADVISORY

FAIL