531 FJJ


531FJJ is registered to a Black 1963, Morris Minor with a Petrol engine. It Failed its most recent MOT Test on the 24 February 2006

2 unique faults (2 Total) reported in its MOT History (2 Tests).

0 common/recurring faults.

50% (1) MOT Pass Rate and a 50% (1) MOT Failure Rate.

92,020 recorded miles.

531 FJJ


531FJJ is registered to a Black 1963, Morris Minor with a Petrol engine. It Failed its most recent MOT Test on the 24 February 2006

2 unique faults (2 Total) reported in its MOT History (2 Tests).

0 common/recurring faults.

50% (1) MOT Pass Rate and a 50% (1) MOT Failure Rate.

92,020 recorded miles.

MOT PASS/Failure rate for 531 FJJ

all MOT test results for 531 FJJ represented as a percentage
MOT PASS/Failure rate for 531 FJJ
all MOT test results for 531 FJJ represented as a percentage

PERCENTAGE OF VEHICLE FAULTS WITH 531 FJJ

ALL REPORTED FAULTS, DISPLAYED BY PERCENTAGE OF OCCURRENCE DURING ALL MOT TESTS
PERCENTAGE OF VEHICLE FAULTS WITH 531 FJJ
ALL REPORTED FAULTS, DISPLAYED BY PERCENTAGE OF OCCURRENCE DURING ALL MOT TESTS
FAIL

531 FJJ annual Faults by type

ALL REPORTED FAULTS, DISPLAYED over time and categorised by type
531 FJJ annual Faults by type
ALL REPORTED FAULTS, DISPLAYED over time and categorised by type

ALL 531 FJJ Failure Faults [2]

ALL Failure faults, ORDERED by OCCURRENCE DURING 531 FJJ's MOT HISTORY
ALL 531 FJJ Failure Faults [2]
ALL Failure faults, ORDERED by OCCURRENCE DURING 531 FJJ's MOT HISTORY
Fail Faults | source www.vehiclestats.co.uk
Fault Fault Test Date Test Date/Time Reference MOT Test Reference
1 Nearside front tie bar/rod locating pin insecure (2.4.g.3a) Nearside front tie bar/rod locating pin insecure (2.4.g.3a) 22 February 2006 [10:36] 22/02/2006 541423556043 541423556043
1 Nearside rear brake clevis joint locking device insecure (3.5.1l) Nearside rear brake clevis joint locking device insecure (3.5.1l) 22 February 2006 [10:36] 22/02/2006 541423556043 541423556043

MOT TEST: 24 February 2006 10:21:03 PASSED
MOT TEST: 24 February 2006 10:21:03 PASSED

This test (400205656055) was completed on the 24 February 2006 10:21:03 and PASSED the requirements for a valid MOT with 0 comments.

This test (400205656055) was completed on the 24 February 2006 10:21:03 and PASSED the requirements for a valid MOT with 0 comments.

Recorded mileage: 92,020

Recorded mileage: 92,020


MOT TEST: 22 February 2006 10:36:24 FAILED
MOT TEST: 22 February 2006 10:36:24 FAILED

This test (541423556043) was completed on the 22 February 2006 10:36:24 and FAILED the requirements for a valid MOT with 2 comments.

This test (541423556043) was completed on the 22 February 2006 10:36:24 and FAILED the requirements for a valid MOT with 2 comments.

Recorded mileage: 92,020

Recorded mileage: 92,020


FAIL