531 XMT


531XMT is registered to a Green 1960, Morris Minor with a Petrol engine. It Failed its most recent MOT Test on the 01 February 2018

9 unique faults (10 Total) reported in its MOT History (6 Tests).

1 common/recurring faults.

67% (4) MOT Pass Rate and a 33% (2) MOT Failure Rate.

46,065 recorded miles.

531 XMT


531XMT is registered to a Green 1960, Morris Minor with a Petrol engine. It Failed its most recent MOT Test on the 01 February 2018

9 unique faults (10 Total) reported in its MOT History (6 Tests).

1 common/recurring faults.

67% (4) MOT Pass Rate and a 33% (2) MOT Failure Rate.

46,065 recorded miles.

MOT PASS/Failure rate for 531 XMT

all MOT test results for 531 XMT represented as a percentage
MOT PASS/Failure rate for 531 XMT
all MOT test results for 531 XMT represented as a percentage

PERCENTAGE OF VEHICLE FAULTS WITH 531 XMT

ALL REPORTED FAULTS, DISPLAYED BY PERCENTAGE OF OCCURRENCE DURING ALL MOT TESTS
PERCENTAGE OF VEHICLE FAULTS WITH 531 XMT
ALL REPORTED FAULTS, DISPLAYED BY PERCENTAGE OF OCCURRENCE DURING ALL MOT TESTS
ADVISORY

FAIL

531 XMT annual Faults by type

ALL REPORTED FAULTS, DISPLAYED over time and categorised by type
531 XMT annual Faults by type
ALL REPORTED FAULTS, DISPLAYED over time and categorised by type

ALL 531 XMT ADVISORIES [2]

ALL ADVISORIES, ORDERED by OCCURRENCE DURING 531 XMT's MOT HISTORY
ALL 531 XMT ADVISORIES [2]
ALL ADVISORIES, ORDERED by OCCURRENCE DURING 531 XMT's MOT HISTORY
Advisory Faults | source www.vehiclestats.co.uk
Fault Fault Test Date Test Date/Time Reference MOT Test Reference
2 Nearside front wheel bearing has slight play (2.5.a.3c) Nearside front wheel bearing has slight play (2.5.a.3c) 07 August 2014 [16:27] 07/08/2014 04 August 2014 [16:52] 04/08/2014 359059614422 359059614422 859176814298 859176814298

ALL 531 XMT Failure Faults [8]

ALL Failure faults, ORDERED by OCCURRENCE DURING 531 XMT's MOT HISTORY
ALL 531 XMT Failure Faults [8]
ALL Failure faults, ORDERED by OCCURRENCE DURING 531 XMT's MOT HISTORY
Fail Faults | source www.vehiclestats.co.uk
Fault Fault Test Date Test Date/Time Reference MOT Test Reference
1 Battery insecure (1.9.1) Battery insecure (1.9.1) 31 January 2018 [08:50] 31/01/2018 696196482126 696196482126
1 Nearside front mechanical brake component has restricted free movement (3.5.1k) Nearside front mechanical brake component has restricted free movement (3.5.1k) 31 January 2018 [08:50] 31/01/2018 696196482126 696196482126
1 Offside rear parking brake recording little or no effort (3.7.b.6a) Offside rear parking brake recording little or no effort (3.7.b.6a) 31 January 2018 [08:50] 31/01/2018 696196482126 696196482126
1 Parking brake: efficiency below requirements (3.7.b.7) Parking brake: efficiency below requirements (3.7.b.7) 31 January 2018 [08:50] 31/01/2018 696196482126 696196482126
1 Nearside rear brake recording little or no effort (3.7.b.5a) Nearside rear brake recording little or no effort (3.7.b.5a) 04 August 2014 [16:52] 04/08/2014 859176814298 859176814298
1 Offside rear brake recording little or no effort (3.7.b.5a) Offside rear brake recording little or no effort (3.7.b.5a) 04 August 2014 [16:52] 04/08/2014 859176814298 859176814298
1 Nearside rear parking brake recording little or no effort (3.7.b.6a) Nearside rear parking brake recording little or no effort (3.7.b.6a) 04 August 2014 [16:52] 04/08/2014 859176814298 859176814298
1 Service brake: efficiency below requirements (3.7.b.7) Service brake: efficiency below requirements (3.7.b.7) 04 August 2014 [16:52] 04/08/2014 859176814298 859176814298

MOT TEST: 01 February 2018 15:56:51 PASSED
MOT TEST: 01 February 2018 15:56:51 PASSED

This test (172712813550) was completed on the 01 February 2018 15:56:51 and PASSED the requirements for a valid MOT with 0 comments.

This test (172712813550) was completed on the 01 February 2018 15:56:51 and PASSED the requirements for a valid MOT with 0 comments.

Recorded mileage: 1,208

Recorded mileage: 1,208


MOT TEST: 31 January 2018 08:50:36 FAILED
MOT TEST: 31 January 2018 08:50:36 FAILED

This test (696196482126) was completed on the 31 January 2018 08:50:36 and FAILED the requirements for a valid MOT with 4 comments.

This test (696196482126) was completed on the 31 January 2018 08:50:36 and FAILED the requirements for a valid MOT with 4 comments.

Recorded mileage: 1,206

Recorded mileage: 1,206


FAIL


MOT TEST: 23 June 2016 13:52:38 PASSED
MOT TEST: 23 June 2016 13:52:38 PASSED

This test (631041859216) was completed on the 23 June 2016 13:52:38 and PASSED the requirements for a valid MOT with 0 comments.

This test (631041859216) was completed on the 23 June 2016 13:52:38 and PASSED the requirements for a valid MOT with 0 comments.

Recorded mileage: 1,141

Recorded mileage: 1,141


MOT TEST: 08 June 2015 16:51:45 PASSED
MOT TEST: 08 June 2015 16:51:45 PASSED

This test (159439655177) was completed on the 08 June 2015 16:51:45 and PASSED the requirements for a valid MOT with 0 comments.

This test (159439655177) was completed on the 08 June 2015 16:51:45 and PASSED the requirements for a valid MOT with 0 comments.

Recorded mileage: 1,073

Recorded mileage: 1,073


MOT TEST: 07 August 2014 16:27:47 PASSED
MOT TEST: 07 August 2014 16:27:47 PASSED

This test (359059614422) was completed on the 07 August 2014 16:27:47 and PASSED the requirements for a valid MOT with 1 comments.

This test (359059614422) was completed on the 07 August 2014 16:27:47 and PASSED the requirements for a valid MOT with 1 comments.

Recorded mileage: 46,065

Recorded mileage: 46,065


ADVISORY


MOT TEST: 04 August 2014 16:52:23 FAILED
MOT TEST: 04 August 2014 16:52:23 FAILED

This test (859176814298) was completed on the 04 August 2014 16:52:23 and FAILED the requirements for a valid MOT with 5 comments.

This test (859176814298) was completed on the 04 August 2014 16:52:23 and FAILED the requirements for a valid MOT with 5 comments.

Recorded mileage: 46,065

Recorded mileage: 46,065


ADVISORY

FAIL