532 XDE


532XDE is registered to a Blue 1964, Morris 1100 with a Petrol engine. It Failed its most recent MOT Test on the 07 March 2019

22 unique faults (28 Total) reported in its MOT History (24 Tests).

4 common/recurring faults, the most frequent (3 times) is: Nearside Front Headlamp not working on dipped beam (1.7.5a).

50% (12) MOT Pass Rate and a 50% (12) MOT Failure Rate.

27,200 recorded miles.

532 XDE


532XDE is registered to a Blue 1964, Morris 1100 with a Petrol engine. It Failed its most recent MOT Test on the 07 March 2019

22 unique faults (28 Total) reported in its MOT History (24 Tests).

4 common/recurring faults, the most frequent (3 times) is: Nearside Front Headlamp not working on dipped beam (1.7.5a).

50% (12) MOT Pass Rate and a 50% (12) MOT Failure Rate.

27,200 recorded miles.

MOT PASS/Failure rate for 532 XDE

all MOT test results for 532 XDE represented as a percentage
MOT PASS/Failure rate for 532 XDE
all MOT test results for 532 XDE represented as a percentage

PERCENTAGE OF VEHICLE FAULTS WITH 532 XDE

ALL REPORTED FAULTS, DISPLAYED BY PERCENTAGE OF OCCURRENCE DURING ALL MOT TESTS
PERCENTAGE OF VEHICLE FAULTS WITH 532 XDE
ALL REPORTED FAULTS, DISPLAYED BY PERCENTAGE OF OCCURRENCE DURING ALL MOT TESTS
ADVISORY

FAIL

532 XDE annual Faults by type

ALL REPORTED FAULTS, DISPLAYED over time and categorised by type
532 XDE annual Faults by type
ALL REPORTED FAULTS, DISPLAYED over time and categorised by type

RECURRING FAULTS WITH 532 XDE

FAULTS THAT HAVE OCCURED MORE THAN ONCE DURING 532 XDE's MOT HISTORY
RECURRING FAULTS WITH 532 XDE
FAULTS THAT HAVE OCCURED MORE THAN ONCE DURING 532 XDE's MOT HISTORY
Fault Fault Test Date Test Date/Time Reference MOT Test Reference
3 Nearside front headlamp not working on dipped beam (1.7.5a) Nearside front headlamp not working on dipped beam (1.7.5a) 09 September 2014 [10:10] 09/09/2014 04 September 2013 [16:03] 04/09/2013 10 September 2012 [12:35] 10/09/2012 996242454276 996242454276 635537743218 635537743218 977094352233 977094352233
3 Brakes imbalanced across an axle (3.7.b.5b) Brakes imbalanced across an axle (3.7.b.5b) 12 September 2011 [10:22] 12/09/2011 17 January 2008 [11:46] 17/01/2008 07 December 2006 [10:15] 07/12/2006 929525951281 929525951281 132307818427 132307818427 321601546334 321601546334
2 Nearside rear suspension spring mounting prescribed area is excessively corroded (2.4.a.3) Nearside rear suspension spring mounting prescribed area is excessively corroded (2.4.a.3) 29 November 2017 [12:12] 29/11/2017 07 December 2006 [10:15] 07/12/2006 443900108982 443900108982 321601546334 321601546334
2 Offside front tyre worn close to the legal limit (4.1.e.1) Offside front tyre worn close to the legal limit (4.1.e.1) 20 July 2009 [10:09] 20/07/2009 29 May 2009 [09:52] 29/05/2009 281051009282 281051009282 881049149136 881049149136

ALL 532 XDE ADVISORIES [4]

ALL ADVISORIES, ORDERED by OCCURRENCE DURING 532 XDE's MOT HISTORY
ALL 532 XDE ADVISORIES [4]
ALL ADVISORIES, ORDERED by OCCURRENCE DURING 532 XDE's MOT HISTORY
Advisory Faults | source www.vehiclestats.co.uk
Fault Fault Test Date Test Date/Time Reference MOT Test Reference
2 Offside front tyre worn close to the legal limit (4.1.e.1) Offside front tyre worn close to the legal limit (4.1.e.1) 20 July 2009 [10:09] 20/07/2009 29 May 2009 [09:52] 29/05/2009 281051009282 281051009282 881049149136 881049149136
1 Nearside suspension spring mounting prescribed area is corroded but not considered excessive middle floor (2.4.a.3) Nearside suspension spring mounting prescribed area is corroded but not considered excessive middle floor (2.4.a.3) 29 November 2017 [12:12] 29/11/2017 443900108982 443900108982
1 Nearside rear suspension spring mounting prescribed area is corroded but not considered excessive (2.4.a.3) Nearside rear suspension spring mounting prescribed area is corroded but not considered excessive (2.4.a.3) 12 December 2016 [11:01] 12/12/2016 946835632765 946835632765

ALL 532 XDE Failure Faults [24]

ALL Failure faults, ORDERED by OCCURRENCE DURING 532 XDE's MOT HISTORY
ALL 532 XDE Failure Faults [24]
ALL Failure faults, ORDERED by OCCURRENCE DURING 532 XDE's MOT HISTORY
Fail Faults | source www.vehiclestats.co.uk
Fault Fault Test Date Test Date/Time Reference MOT Test Reference
3 Nearside front headlamp not working on dipped beam (1.7.5a) Nearside front headlamp not working on dipped beam (1.7.5a) 09 September 2014 [10:10] 09/09/2014 04 September 2013 [16:03] 04/09/2013 10 September 2012 [12:35] 10/09/2012 996242454276 996242454276 635537743218 635537743218 977094352233 977094352233
3 Brakes imbalanced across an axle (3.7.b.5b) Brakes imbalanced across an axle (3.7.b.5b) 12 September 2011 [10:22] 12/09/2011 17 January 2008 [11:46] 17/01/2008 07 December 2006 [10:15] 07/12/2006 929525951281 929525951281 132307818427 132307818427 321601546334 321601546334
2 Nearside rear suspension spring mounting prescribed area is excessively corroded (2.4.a.3) Nearside rear suspension spring mounting prescribed area is excessively corroded (2.4.a.3) 29 November 2017 [12:12] 29/11/2017 07 December 2006 [10:15] 07/12/2006 443900108982 443900108982 321601546334 321601546334
1 Nearside rear seat belt anchorage prescribed area strength or continuity significantly reduced inner wing & wheel arch (7.1.1 (a) (i)) Nearside rear seat belt anchorage prescribed area strength or continuity significantly reduced inner wing & wheel arch (7.1.1 (a) (i)) 07 March 2019 [16:12] 07/03/2019 623809658869 623809658869
1 Offside rear suspension component mounting prescribed area is excessively corroded floor (2.4.a.3) Offside rear suspension component mounting prescribed area is excessively corroded floor (2.4.a.3) 19 September 2016 [14:07] 19/09/2016 874224677038 874224677038
1 Front brakes imbalanced across an axle (3.7.b.5b) Front brakes imbalanced across an axle (3.7.b.5b) 01 September 2015 [16:27] 01/09/2015 200835825254 200835825254
1 Offside front direction indicator not working (1.4.a.2c) Offside front direction indicator not working (1.4.a.2c) 04 September 2013 [16:03] 04/09/2013 635537743218 635537743218
1 Nearside front headlamp not working on main beam (1.7.5a) Nearside front headlamp not working on main beam (1.7.5a) 04 September 2013 [16:03] 04/09/2013 635537743218 635537743218
1 Nearside front steering rack gaiter split (2.2.d.2d) Nearside front steering rack gaiter split (2.2.d.2d) 04 September 2013 [16:03] 04/09/2013 635537743218 635537743218
1 Front brake application uneven (3.7.b.2) Front brake application uneven (3.7.b.2) 12 September 2011 [10:22] 12/09/2011 929525951281 929525951281
1 Nearside rear position lamp(s) not working (1.1.a.3b) Nearside rear position lamp(s) not working (1.1.a.3b) 12 July 2010 [15:07] 12/07/2010 280723490124 280723490124
1 Nearside rear stop lamp not working (1.2.1b) Nearside rear stop lamp not working (1.2.1b) 12 July 2010 [15:07] 12/07/2010 280723490124 280723490124
1 Offside front tyre tread depth below requirements of 1.6mm (4.1.e.1) Offside front tyre tread depth below requirements of 1.6mm (4.1.e.1) 12 July 2010 [15:07] 12/07/2010 280723490124 280723490124
1 Nearside front position lamp(s) missing (1.1.a.3a) Nearside front position lamp(s) missing (1.1.a.3a) 29 May 2009 [09:52] 29/05/2009 881049149136 881049149136
1 Offside front position lamp(s) missing (1.1.a.3a) Offside front position lamp(s) missing (1.1.a.3a) 29 May 2009 [09:52] 29/05/2009 881049149136 881049149136
1 Nearside vehicle structure has excessive corrosion, seriously affecting its strength within 30cm of the body mountings (6.1.b.2) Nearside vehicle structure has excessive corrosion, seriously affecting its strength within 30cm of the body mountings (6.1.b.2) 17 January 2008 [11:46] 17/01/2008 132307818427 132307818427
1 Offside front brake recording little or no effort (3.7.b.5a) Offside front brake recording little or no effort (3.7.b.5a) 17 January 2008 [11:46] 17/01/2008 132307818427 132307818427
1 Offside rear suspension spring mounting prescribed area is excessively corroded (2.4.a.3) Offside rear suspension spring mounting prescribed area is excessively corroded (2.4.a.3) 07 December 2006 [10:15] 07/12/2006 321601546334 321601546334
1 Nearside front brake recording little or no effort (3.7.b.5a) Nearside front brake recording little or no effort (3.7.b.5a) 07 December 2006 [10:15] 07/12/2006 321601546334 321601546334

MOT TEST: 07 March 2019 16:12:32 FAILED
MOT TEST: 07 March 2019 16:12:32 FAILED

This test (623809658869) was completed on the 07 March 2019 16:12:32 and FAILED the requirements for a valid MOT with 1 comments.

This test (623809658869) was completed on the 07 March 2019 16:12:32 and FAILED the requirements for a valid MOT with 1 comments.

Recorded mileage: 27,200

Recorded mileage: 27,200


FAIL


MOT TEST: 12 January 2018 17:24:53 PASSED
MOT TEST: 12 January 2018 17:24:53 PASSED

This test (744380796093) was completed on the 12 January 2018 17:24:53 and PASSED the requirements for a valid MOT with 0 comments.

This test (744380796093) was completed on the 12 January 2018 17:24:53 and PASSED the requirements for a valid MOT with 0 comments.

Recorded mileage: 26,695

Recorded mileage: 26,695


MOT TEST: 29 November 2017 12:12:07 FAILED
MOT TEST: 29 November 2017 12:12:07 FAILED

This test (443900108982) was completed on the 29 November 2017 12:12:07 and FAILED the requirements for a valid MOT with 2 comments.

This test (443900108982) was completed on the 29 November 2017 12:12:07 and FAILED the requirements for a valid MOT with 2 comments.

Recorded mileage: 26,688

Recorded mileage: 26,688


ADVISORY

FAIL


MOT TEST: 12 December 2016 11:01:48 PASSED
MOT TEST: 12 December 2016 11:01:48 PASSED

This test (946835632765) was completed on the 12 December 2016 11:01:48 and PASSED the requirements for a valid MOT with 1 comments.

This test (946835632765) was completed on the 12 December 2016 11:01:48 and PASSED the requirements for a valid MOT with 1 comments.

Recorded mileage: 26,162

Recorded mileage: 26,162


ADVISORY


MOT TEST: 19 September 2016 14:07:42 FAILED
MOT TEST: 19 September 2016 14:07:42 FAILED

This test (874224677038) was completed on the 19 September 2016 14:07:42 and FAILED the requirements for a valid MOT with 1 comments.

This test (874224677038) was completed on the 19 September 2016 14:07:42 and FAILED the requirements for a valid MOT with 1 comments.

Recorded mileage: 26,155

Recorded mileage: 26,155


FAIL


MOT TEST: 15 September 2015 17:01:47 PASSED
MOT TEST: 15 September 2015 17:01:47 PASSED

This test (906676523336) was completed on the 15 September 2015 17:01:47 and PASSED the requirements for a valid MOT with 0 comments.

This test (906676523336) was completed on the 15 September 2015 17:01:47 and PASSED the requirements for a valid MOT with 0 comments.

Recorded mileage: 25,474

Recorded mileage: 25,474


MOT TEST: 01 September 2015 16:27:34 FAILED
MOT TEST: 01 September 2015 16:27:34 FAILED

This test (200835825254) was completed on the 01 September 2015 16:27:34 and FAILED the requirements for a valid MOT with 1 comments.

This test (200835825254) was completed on the 01 September 2015 16:27:34 and FAILED the requirements for a valid MOT with 1 comments.

Recorded mileage: 25,474

Recorded mileage: 25,474


FAIL


MOT TEST: 16 September 2014 18:04:18 PASSED
MOT TEST: 16 September 2014 18:04:18 PASSED

This test (299199054222) was completed on the 16 September 2014 18:04:18 and PASSED the requirements for a valid MOT with 0 comments.

This test (299199054222) was completed on the 16 September 2014 18:04:18 and PASSED the requirements for a valid MOT with 0 comments.

Recorded mileage: 24,918

Recorded mileage: 24,918


MOT TEST: 09 September 2014 10:10:27 FAILED
MOT TEST: 09 September 2014 10:10:27 FAILED

This test (996242454276) was completed on the 09 September 2014 10:10:27 and FAILED the requirements for a valid MOT with 1 comments.

This test (996242454276) was completed on the 09 September 2014 10:10:27 and FAILED the requirements for a valid MOT with 1 comments.

Recorded mileage: 24,918

Recorded mileage: 24,918


FAIL


MOT TEST: 10 September 2013 10:24:23 PASSED
MOT TEST: 10 September 2013 10:24:23 PASSED

This test (756613353214) was completed on the 10 September 2013 10:24:23 and PASSED the requirements for a valid MOT with 0 comments.

This test (756613353214) was completed on the 10 September 2013 10:24:23 and PASSED the requirements for a valid MOT with 0 comments.

Recorded mileage: 24,430

Recorded mileage: 24,430


MOT TEST: 04 September 2013 16:03:58 FAILED
MOT TEST: 04 September 2013 16:03:58 FAILED

This test (635537743218) was completed on the 04 September 2013 16:03:58 and FAILED the requirements for a valid MOT with 4 comments.

This test (635537743218) was completed on the 04 September 2013 16:03:58 and FAILED the requirements for a valid MOT with 4 comments.

Recorded mileage: 24,430

Recorded mileage: 24,430


FAIL


MOT TEST: 12 September 2012 09:48:52 PASSED
MOT TEST: 12 September 2012 09:48:52 PASSED

This test (626916652270) was completed on the 12 September 2012 09:48:52 and PASSED the requirements for a valid MOT with 0 comments.

This test (626916652270) was completed on the 12 September 2012 09:48:52 and PASSED the requirements for a valid MOT with 0 comments.

Recorded mileage: 23,973

Recorded mileage: 23,973


MOT TEST: 10 September 2012 12:35:30 FAILED
MOT TEST: 10 September 2012 12:35:30 FAILED

This test (977094352233) was completed on the 10 September 2012 12:35:30 and FAILED the requirements for a valid MOT with 1 comments.

This test (977094352233) was completed on the 10 September 2012 12:35:30 and FAILED the requirements for a valid MOT with 1 comments.

Recorded mileage: 23,973

Recorded mileage: 23,973


FAIL


MOT TEST: 14 September 2011 09:25:47 PASSED
MOT TEST: 14 September 2011 09:25:47 PASSED

This test (838727751204) was completed on the 14 September 2011 09:25:47 and PASSED the requirements for a valid MOT with 0 comments.

This test (838727751204) was completed on the 14 September 2011 09:25:47 and PASSED the requirements for a valid MOT with 0 comments.

Recorded mileage: 23,510

Recorded mileage: 23,510


MOT TEST: 12 September 2011 10:22:11 FAILED
MOT TEST: 12 September 2011 10:22:11 FAILED

This test (929525951281) was completed on the 12 September 2011 10:22:11 and FAILED the requirements for a valid MOT with 2 comments.

This test (929525951281) was completed on the 12 September 2011 10:22:11 and FAILED the requirements for a valid MOT with 2 comments.

Recorded mileage: 23,510

Recorded mileage: 23,510


FAIL


MOT TEST: 18 August 2010 09:55:50 PASSED
MOT TEST: 18 August 2010 09:55:50 PASSED

This test (501830830271) was completed on the 18 August 2010 09:55:50 and PASSED the requirements for a valid MOT with 0 comments.

This test (501830830271) was completed on the 18 August 2010 09:55:50 and PASSED the requirements for a valid MOT with 0 comments.

Recorded mileage: 23,013

Recorded mileage: 23,013


MOT TEST: 12 July 2010 15:07:06 FAILED
MOT TEST: 12 July 2010 15:07:06 FAILED

This test (280723490124) was completed on the 12 July 2010 15:07:06 and FAILED the requirements for a valid MOT with 3 comments.

This test (280723490124) was completed on the 12 July 2010 15:07:06 and FAILED the requirements for a valid MOT with 3 comments.

Recorded mileage: 23,000

Recorded mileage: 23,000


FAIL


MOT TEST: 20 July 2009 10:09:01 PASSED
MOT TEST: 20 July 2009 10:09:01 PASSED

This test (281051009282) was completed on the 20 July 2009 10:09:01 and PASSED the requirements for a valid MOT with 1 comments.

This test (281051009282) was completed on the 20 July 2009 10:09:01 and PASSED the requirements for a valid MOT with 1 comments.

Recorded mileage: 22,723

Recorded mileage: 22,723


ADVISORY


MOT TEST: 29 May 2009 09:52:20 FAILED
MOT TEST: 29 May 2009 09:52:20 FAILED

This test (881049149136) was completed on the 29 May 2009 09:52:20 and FAILED the requirements for a valid MOT with 3 comments.

This test (881049149136) was completed on the 29 May 2009 09:52:20 and FAILED the requirements for a valid MOT with 3 comments.

Recorded mileage: 22,273

Recorded mileage: 22,273


ADVISORY

FAIL


MOT TEST: 20 February 2008 11:46:01 PASSED
MOT TEST: 20 February 2008 11:46:01 PASSED

This test (423901558009) was completed on the 20 February 2008 11:46:01 and PASSED the requirements for a valid MOT with 0 comments.

This test (423901558009) was completed on the 20 February 2008 11:46:01 and PASSED the requirements for a valid MOT with 0 comments.

Recorded mileage: 22,244

Recorded mileage: 22,244


MOT TEST: 17 January 2008 11:46:25 FAILED
MOT TEST: 17 January 2008 11:46:25 FAILED

This test (132307818427) was completed on the 17 January 2008 11:46:25 and FAILED the requirements for a valid MOT with 3 comments.

This test (132307818427) was completed on the 17 January 2008 11:46:25 and FAILED the requirements for a valid MOT with 3 comments.

Recorded mileage: 22,243

Recorded mileage: 22,243


FAIL


MOT TEST: 14 December 2006 10:41:43 PASSED
MOT TEST: 14 December 2006 10:41:43 PASSED

This test (602298046360) was completed on the 14 December 2006 10:41:43 and PASSED the requirements for a valid MOT with 0 comments.

This test (602298046360) was completed on the 14 December 2006 10:41:43 and PASSED the requirements for a valid MOT with 0 comments.

Recorded mileage: 21,798

Recorded mileage: 21,798


MOT TEST: 07 December 2006 10:15:59 FAILED
MOT TEST: 07 December 2006 10:15:59 FAILED

This test (321601546334) was completed on the 07 December 2006 10:15:59 and FAILED the requirements for a valid MOT with 4 comments.

This test (321601546334) was completed on the 07 December 2006 10:15:59 and FAILED the requirements for a valid MOT with 4 comments.

Recorded mileage: 21,788

Recorded mileage: 21,788


FAIL


MOT TEST: 29 December 2005 10:50:57 PASSED
MOT TEST: 29 December 2005 10:50:57 PASSED

This test (563163465319) was completed on the 29 December 2005 10:50:57 and PASSED the requirements for a valid MOT with 0 comments.

This test (563163465319) was completed on the 29 December 2005 10:50:57 and PASSED the requirements for a valid MOT with 0 comments.

Recorded mileage: 20,841

Recorded mileage: 20,841