537 HTT


537HTT is registered to a Grey 1961, Morris Minor with a Petrol engine. It Failed its most recent MOT Test on the 16 April 2018

28 unique faults (28 Total) reported in its MOT History (6 Tests).

0 common/recurring faults.

67% (4) MOT Pass Rate and a 33% (2) MOT Failure Rate.

33,553 recorded miles.

537 HTT


537HTT is registered to a Grey 1961, Morris Minor with a Petrol engine. It Failed its most recent MOT Test on the 16 April 2018

28 unique faults (28 Total) reported in its MOT History (6 Tests).

0 common/recurring faults.

67% (4) MOT Pass Rate and a 33% (2) MOT Failure Rate.

33,553 recorded miles.

MOT PASS/Failure rate for 537 HTT

all MOT test results for 537 HTT represented as a percentage
MOT PASS/Failure rate for 537 HTT
all MOT test results for 537 HTT represented as a percentage

PERCENTAGE OF VEHICLE FAULTS WITH 537 HTT

ALL REPORTED FAULTS, DISPLAYED BY PERCENTAGE OF OCCURRENCE DURING ALL MOT TESTS
PERCENTAGE OF VEHICLE FAULTS WITH 537 HTT
ALL REPORTED FAULTS, DISPLAYED BY PERCENTAGE OF OCCURRENCE DURING ALL MOT TESTS
ADVISORY

FAIL

537 HTT annual Faults by type

ALL REPORTED FAULTS, DISPLAYED over time and categorised by type
537 HTT annual Faults by type
ALL REPORTED FAULTS, DISPLAYED over time and categorised by type

ALL 537 HTT ADVISORIES [11]

ALL ADVISORIES, ORDERED by OCCURRENCE DURING 537 HTT's MOT HISTORY
ALL 537 HTT ADVISORIES [11]
ALL ADVISORIES, ORDERED by OCCURRENCE DURING 537 HTT's MOT HISTORY
Advisory Faults | source www.vehiclestats.co.uk
Fault Fault Test Date Test Date/Time Reference MOT Test Reference
1 Nearside front wheel bearing has slight play (2.5.a.3c) Nearside front wheel bearing has slight play (2.5.a.3c) 16 April 2018 [10:08] 16/04/2018 828674699986 828674699986
1 Nearside front suspension has slight play in a upper suspension ball joint trunion (2.5.b.1a) Nearside front suspension has slight play in a upper suspension ball joint trunion (2.5.b.1a) 16 April 2018 [10:08] 16/04/2018 828674699986 828674699986
1 Offside rear bump stop missing Offside rear bump stop missing 16 April 2018 [10:08] 16/04/2018 828674699986 828674699986
1 Offside rear tyre starting to wear on inside edge Offside rear tyre starting to wear on inside edge 16 April 2018 [10:08] 16/04/2018 828674699986 828674699986
1 Drivers door hinge deteriorated but the door can still be readily opened and closed (6.2.b.2) Drivers door hinge deteriorated but the door can still be readily opened and closed (6.2.b.2) 21 December 2017 [12:46] 21/12/2017 413176258342 413176258342
1 Nearside front front wheel bearing has slight play (2.5.a.3c) Nearside front front wheel bearing has slight play (2.5.a.3c) 21 December 2017 [12:46] 21/12/2017 413176258342 413176258342
1 Indicator stalk slightly worn Indicator stalk slightly worn 30 November 2016 [09:12] 30/11/2016 498882389634 498882389634
1 Nearside front wheel bearing slightly noisy when rotated Nearside front wheel bearing slightly noisy when rotated 30 November 2016 [09:12] 30/11/2016 498882389634 498882389634
1 Slight corrosion to offside rear, just outside suspension prescribed area Slight corrosion to offside rear, just outside suspension prescribed area 30 November 2016 [09:12] 30/11/2016 498882389634 498882389634
1 All tyres slightly perished, offside rear tyre worn on inner edge, and slight flat spot to offside front tyre. All tyres slightly perished, offside rear tyre worn on inner edge, and slight flat spot to offside front tyre. 30 November 2016 [09:12] 30/11/2016 498882389634 498882389634
1 Nearside rear shock absorber has a light misting of oil (2.7.3) Nearside rear shock absorber has a light misting of oil (2.7.3) 09 December 2014 [16:15] 09/12/2014 636463444343 636463444343

ALL 537 HTT Failure Faults [17]

ALL Failure faults, ORDERED by OCCURRENCE DURING 537 HTT's MOT HISTORY
ALL 537 HTT Failure Faults [17]
ALL Failure faults, ORDERED by OCCURRENCE DURING 537 HTT's MOT HISTORY
Advisory Faults | source www.vehiclestats.co.uk
Fault Fault Test Date Test Date/Time Reference MOT Test Reference
1 Horn not working (1.6.2a) Horn not working (1.6.2a) 16 April 2018 [10:08] 16/04/2018 828674699986 828674699986
1 Nearside rear stop lamp not working (1.2.1b) Nearside rear stop lamp not working (1.2.1b) 16 April 2018 [10:08] 16/04/2018 828674699986 828674699986
1 Offside rear stop lamp not working (1.2.1b) Offside rear stop lamp not working (1.2.1b) 16 April 2018 [10:08] 16/04/2018 828674699986 828674699986
1 Drivers door cannot be opened from inside the vehicle (6.2.b.1b) Drivers door cannot be opened from inside the vehicle (6.2.b.1b) 09 December 2014 [16:15] 09/12/2014 636463444343 636463444343
1 Horn control missing (1.6.1) Horn control missing (1.6.1) 09 December 2014 [16:15] 09/12/2014 636463444343 636463444343
1 Steering wheel retaining device insecure (2.1.6) Steering wheel retaining device insecure (2.1.6) 09 December 2014 [16:15] 09/12/2014 636463444343 636463444343
1 Nearside front seat belt insecurely fixed to the vehicles structure (5.2.1a) Nearside front seat belt insecurely fixed to the vehicles structure (5.2.1a) 09 December 2014 [16:15] 09/12/2014 636463444343 636463444343
1 Nearside windscreen wiper blade missing (8.2.2) Nearside windscreen wiper blade missing (8.2.2) 09 December 2014 [16:15] 09/12/2014 636463444343 636463444343
1 Windscreen washer provides insufficient washer liquid (8.2.3) Windscreen washer provides insufficient washer liquid (8.2.3) 09 December 2014 [16:15] 09/12/2014 636463444343 636463444343
1 Offside front direction indicators not working (1.4.a.2c) Offside front direction indicators not working (1.4.a.2c) 09 December 2014 [16:15] 09/12/2014 636463444343 636463444343
1 Offside rear direction indicators not working (1.4.a.2c) Offside rear direction indicators not working (1.4.a.2c) 09 December 2014 [16:15] 09/12/2014 636463444343 636463444343
1 Nearside front upper front suspension locking device ineffective (2.5.a.4) Nearside front upper front suspension locking device ineffective (2.5.a.4) 09 December 2014 [16:15] 09/12/2014 636463444343 636463444343
1 Offside front upper front suspension retaining device ineffective (2.5.a.4) Offside front upper front suspension retaining device ineffective (2.5.a.4) 09 December 2014 [16:15] 09/12/2014 636463444343 636463444343
1 Nearside outer suspension component mounting prescribed area is inadequately repaired (2.4.a.3) Nearside outer suspension component mounting prescribed area is inadequately repaired (2.4.a.3) 09 December 2014 [16:15] 09/12/2014 636463444343 636463444343
1 Offside outer suspension component mounting prescribed area is inadequately repaired (2.4.a.3) Offside outer suspension component mounting prescribed area is inadequately repaired (2.4.a.3) 09 December 2014 [16:15] 09/12/2014 636463444343 636463444343
1 Brake pedal has insufficient reserve movement (3.3.a.5) Brake pedal has insufficient reserve movement (3.3.a.5) 09 December 2014 [16:15] 09/12/2014 636463444343 636463444343
1 Brake pedal spongy (3.3.b.1b) Brake pedal spongy (3.3.b.1b) 09 December 2014 [16:15] 09/12/2014 636463444343 636463444343

MOT TEST: 16 April 2018 10:08:58 FAILED
MOT TEST: 16 April 2018 10:08:58 FAILED

This test (828674699986) was completed on the 16 April 2018 10:08:58 and FAILED the requirements for a valid MOT with 7 comments.

This test (828674699986) was completed on the 16 April 2018 10:08:58 and FAILED the requirements for a valid MOT with 7 comments.

Recorded mileage: 20,011

Recorded mileage: 20,011


ADVISORY

FAIL


MOT TEST: 21 December 2017 12:46:42 PASSED
MOT TEST: 21 December 2017 12:46:42 PASSED

This test (413176258342) was completed on the 21 December 2017 12:46:42 and PASSED the requirements for a valid MOT with 2 comments.

This test (413176258342) was completed on the 21 December 2017 12:46:42 and PASSED the requirements for a valid MOT with 2 comments.

Recorded mileage: 19,978

Recorded mileage: 19,978


ADVISORY


MOT TEST: 30 November 2016 09:12:37 PASSED
MOT TEST: 30 November 2016 09:12:37 PASSED

This test (498882389634) was completed on the 30 November 2016 09:12:37 and PASSED the requirements for a valid MOT with 4 comments.

This test (498882389634) was completed on the 30 November 2016 09:12:37 and PASSED the requirements for a valid MOT with 4 comments.

Recorded mileage: 19,556

Recorded mileage: 19,556


ADVISORY


MOT TEST: 19 November 2015 11:35:10 PASSED
MOT TEST: 19 November 2015 11:35:10 PASSED

This test (211463777338) was completed on the 19 November 2015 11:35:10 and PASSED the requirements for a valid MOT with 0 comments.

This test (211463777338) was completed on the 19 November 2015 11:35:10 and PASSED the requirements for a valid MOT with 0 comments.

Recorded mileage: 19,203

Recorded mileage: 19,203


MOT TEST: 10 December 2014 11:55:36 PASSED
MOT TEST: 10 December 2014 11:55:36 PASSED

This test (137594744350) was completed on the 10 December 2014 11:55:36 and PASSED the requirements for a valid MOT with 0 comments.

This test (137594744350) was completed on the 10 December 2014 11:55:36 and PASSED the requirements for a valid MOT with 0 comments.

Recorded mileage: 33,543

Recorded mileage: 33,543


MOT TEST: 09 December 2014 16:15:42 FAILED
MOT TEST: 09 December 2014 16:15:42 FAILED

This test (636463444343) was completed on the 09 December 2014 16:15:42 and FAILED the requirements for a valid MOT with 15 comments.

This test (636463444343) was completed on the 09 December 2014 16:15:42 and FAILED the requirements for a valid MOT with 15 comments.

Recorded mileage: 33,553

Recorded mileage: 33,553


ADVISORY

FAIL