544 CHW


544CHW is registered to a Green 1958, Morris Minor with a Petrol engine. It Failed its most recent MOT Test on the 21 May 2012

17 unique faults (19 Total) reported in its MOT History (11 Tests).

2 common/recurring faults, the most frequent (2 times) is: Offside Front Suspension arm rubber bush deteriorated but not resulting in excessive movement (2.4.G.2).

64% (7) MOT Pass Rate and a 36% (4) MOT Failure Rate.

25,818 recorded miles.

544 CHW


544CHW is registered to a Green 1958, Morris Minor with a Petrol engine. It Failed its most recent MOT Test on the 21 May 2012

17 unique faults (19 Total) reported in its MOT History (11 Tests).

2 common/recurring faults, the most frequent (2 times) is: Offside Front Suspension arm rubber bush deteriorated but not resulting in excessive movement (2.4.G.2).

64% (7) MOT Pass Rate and a 36% (4) MOT Failure Rate.

25,818 recorded miles.

MOT PASS/Failure rate for 544 CHW

all MOT test results for 544 CHW represented as a percentage
MOT PASS/Failure rate for 544 CHW
all MOT test results for 544 CHW represented as a percentage

PERCENTAGE OF VEHICLE FAULTS WITH 544 CHW

ALL REPORTED FAULTS, DISPLAYED BY PERCENTAGE OF OCCURRENCE DURING ALL MOT TESTS
PERCENTAGE OF VEHICLE FAULTS WITH 544 CHW
ALL REPORTED FAULTS, DISPLAYED BY PERCENTAGE OF OCCURRENCE DURING ALL MOT TESTS
ADVISORY

FAIL

544 CHW annual Faults by type

ALL REPORTED FAULTS, DISPLAYED over time and categorised by type
544 CHW annual Faults by type
ALL REPORTED FAULTS, DISPLAYED over time and categorised by type

RECURRING FAULTS WITH 544 CHW

FAULTS THAT HAVE OCCURED MORE THAN ONCE DURING 544 CHW's MOT HISTORY
RECURRING FAULTS WITH 544 CHW
FAULTS THAT HAVE OCCURED MORE THAN ONCE DURING 544 CHW's MOT HISTORY
Fault Fault Test Date Test Date/Time Reference MOT Test Reference
2 Offside front suspension arm rubber bush deteriorated but not resulting in excessive movement (2.4.g.2) Offside front suspension arm rubber bush deteriorated but not resulting in excessive movement (2.4.g.2) 23 May 2009 [08:16] 23/05/2009 20 May 2009 [12:34] 20/05/2009 304593449151 304593449151 953730449105 953730449105
2 Windscreen washer provides insufficient washer liquid (8.2.3) Windscreen washer provides insufficient washer liquid (8.2.3) 20 May 2009 [12:34] 20/05/2009 15 May 2006 [10:17] 15/05/2006 953730449105 953730449105 290075036468 290075036468

ALL 544 CHW ADVISORIES [4]

ALL ADVISORIES, ORDERED by OCCURRENCE DURING 544 CHW's MOT HISTORY
ALL 544 CHW ADVISORIES [4]
ALL ADVISORIES, ORDERED by OCCURRENCE DURING 544 CHW's MOT HISTORY
Advisory Faults | source www.vehiclestats.co.uk
Fault Fault Test Date Test Date/Time Reference MOT Test Reference
2 Offside front suspension arm rubber bush deteriorated but not resulting in excessive movement (2.4.g.2) Offside front suspension arm rubber bush deteriorated but not resulting in excessive movement (2.4.g.2) 23 May 2009 [08:16] 23/05/2009 20 May 2009 [12:34] 20/05/2009 304593449151 304593449151 953730449105 953730449105
1 Front front wheel bearing has slight play (2.5.a.3c) Front front wheel bearing has slight play (2.5.a.3c) 31 May 2007 [09:49] 31/05/2007 462101257125 462101257125
1 Steering column top bearing slightly worn (2.1.2c) Steering column top bearing slightly worn (2.1.2c) 15 May 2006 [10:17] 15/05/2006 290075036468 290075036468

ALL 544 CHW Failure Faults [15]

ALL Failure faults, ORDERED by OCCURRENCE DURING 544 CHW's MOT HISTORY
ALL 544 CHW Failure Faults [15]
ALL Failure faults, ORDERED by OCCURRENCE DURING 544 CHW's MOT HISTORY
Fail Faults | source www.vehiclestats.co.uk
Fault Fault Test Date Test Date/Time Reference MOT Test Reference
2 Windscreen washer provides insufficient washer liquid (8.2.3) Windscreen washer provides insufficient washer liquid (8.2.3) 20 May 2009 [12:34] 20/05/2009 15 May 2006 [10:17] 15/05/2006 953730449105 953730449105 290075036468 290075036468
1 Offside rear position lamp(s) excessively deteriorated so that it is not visible from a reasonable distance (1.1.a.3d) Offside rear position lamp(s) excessively deteriorated so that it is not visible from a reasonable distance (1.1.a.3d) 20 May 2009 [12:34] 20/05/2009 953730449105 953730449105
1 Nearside front passenger seat cannot be secured in the upright position. (6.2.4) Nearside front passenger seat cannot be secured in the upright position. (6.2.4) 20 May 2009 [12:34] 20/05/2009 953730449105 953730449105
1 Nearside headlamp insecure (1.7.3) Nearside headlamp insecure (1.7.3) 20 May 2009 [12:34] 20/05/2009 953730449105 953730449105
1 Parking brake: efficiency below requirements (3.7.b.7) Parking brake: efficiency below requirements (3.7.b.7) 20 May 2009 [12:34] 20/05/2009 953730449105 953730449105
1 Offside front semaphore indicator arm does not extend smoothly (1.4.c.1a) Offside front semaphore indicator arm does not extend smoothly (1.4.c.1a) 14 May 2008 [09:51] 14/05/2008 272625138428 272625138428
1 Drivers seat insecure (6.2.a.1) Drivers seat insecure (6.2.a.1) 15 May 2006 [10:17] 15/05/2006 290075036468 290075036468
1 Offside semaphore indicator arm does not extend smoothly (1.4.c.1a) Offside semaphore indicator arm does not extend smoothly (1.4.c.1a) 15 May 2006 [10:17] 15/05/2006 290075036468 290075036468
1 Brake hydraulic reservoir fluid level below minimum level (3.6.g.1b) Brake hydraulic reservoir fluid level below minimum level (3.6.g.1b) 15 May 2006 [10:17] 15/05/2006 290075036468 290075036468
1 Nearside front tie bar/rod attachment bracket/mounting weld cracked (2.4.g.1) Nearside front tie bar/rod attachment bracket/mounting weld cracked (2.4.g.1) 15 May 2006 [10:17] 15/05/2006 290075036468 290075036468
1 Offside headlamp excessively damaged so that the light output is severely reduced (1.7.5a) Offside headlamp excessively damaged so that the light output is severely reduced (1.7.5a) 23 May 2005 [16:34] 23/05/2005 571093545151 571093545151
1 Offside front wheel bearing has excessive play (2.5.a.3c) Offside front wheel bearing has excessive play (2.5.a.3c) 23 May 2005 [16:34] 23/05/2005 571093545151 571093545151
1 Offside front wheel bearing rough when rotated (2.5.a.2) Offside front wheel bearing rough when rotated (2.5.a.2) 23 May 2005 [16:34] 23/05/2005 571093545151 571093545151
1 Nearside front wheel bearing has excessive play (2.5.a.3c) Nearside front wheel bearing has excessive play (2.5.a.3c) 23 May 2005 [16:34] 23/05/2005 571093545151 571093545151

MOT TEST: 21 May 2012 09:08:15 PASSED
MOT TEST: 21 May 2012 09:08:15 PASSED

This test (185972742128) was completed on the 21 May 2012 09:08:15 and PASSED the requirements for a valid MOT with 0 comments.

This test (185972742128) was completed on the 21 May 2012 09:08:15 and PASSED the requirements for a valid MOT with 0 comments.

Recorded mileage: 25,818

Recorded mileage: 25,818


MOT TEST: 11 May 2011 12:30:38 PASSED
MOT TEST: 11 May 2011 12:30:38 PASSED

This test (925751831102) was completed on the 11 May 2011 12:30:38 and PASSED the requirements for a valid MOT with 0 comments.

This test (925751831102) was completed on the 11 May 2011 12:30:38 and PASSED the requirements for a valid MOT with 0 comments.

Recorded mileage: 25,409

Recorded mileage: 25,409


MOT TEST: 23 May 2009 08:16:59 PASSED
MOT TEST: 23 May 2009 08:16:59 PASSED

This test (304593449151) was completed on the 23 May 2009 08:16:59 and PASSED the requirements for a valid MOT with 1 comments.

This test (304593449151) was completed on the 23 May 2009 08:16:59 and PASSED the requirements for a valid MOT with 1 comments.

Recorded mileage: 24,446

Recorded mileage: 24,446


ADVISORY


MOT TEST: 20 May 2009 12:34:55 FAILED
MOT TEST: 20 May 2009 12:34:55 FAILED

This test (953730449105) was completed on the 20 May 2009 12:34:55 and FAILED the requirements for a valid MOT with 6 comments.

This test (953730449105) was completed on the 20 May 2009 12:34:55 and FAILED the requirements for a valid MOT with 6 comments.

Recorded mileage: 24,446

Recorded mileage: 24,446


ADVISORY

FAIL


MOT TEST: 14 May 2008 12:53:31 PASSED
MOT TEST: 14 May 2008 12:53:31 PASSED

This test (870245238135) was completed on the 14 May 2008 12:53:31 and PASSED the requirements for a valid MOT with 0 comments.

This test (870245238135) was completed on the 14 May 2008 12:53:31 and PASSED the requirements for a valid MOT with 0 comments.

Recorded mileage: 22,256

Recorded mileage: 22,256


MOT TEST: 14 May 2008 09:51:23 FAILED
MOT TEST: 14 May 2008 09:51:23 FAILED

This test (272625138428) was completed on the 14 May 2008 09:51:23 and FAILED the requirements for a valid MOT with 1 comments.

This test (272625138428) was completed on the 14 May 2008 09:51:23 and FAILED the requirements for a valid MOT with 1 comments.

Recorded mileage: 22,256

Recorded mileage: 22,256


FAIL


MOT TEST: 31 May 2007 09:49:43 PASSED
MOT TEST: 31 May 2007 09:49:43 PASSED

This test (462101257125) was completed on the 31 May 2007 09:49:43 and PASSED the requirements for a valid MOT with 1 comments.

This test (462101257125) was completed on the 31 May 2007 09:49:43 and PASSED the requirements for a valid MOT with 1 comments.

Recorded mileage: 20,915

Recorded mileage: 20,915


ADVISORY


MOT TEST: 16 May 2006 08:38:10 PASSED
MOT TEST: 16 May 2006 08:38:10 PASSED

This test (280476036118) was completed on the 16 May 2006 08:38:10 and PASSED the requirements for a valid MOT with 0 comments.

This test (280476036118) was completed on the 16 May 2006 08:38:10 and PASSED the requirements for a valid MOT with 0 comments.

Recorded mileage: 16,613

Recorded mileage: 16,613


MOT TEST: 15 May 2006 10:17:12 FAILED
MOT TEST: 15 May 2006 10:17:12 FAILED

This test (290075036468) was completed on the 15 May 2006 10:17:12 and FAILED the requirements for a valid MOT with 6 comments.

This test (290075036468) was completed on the 15 May 2006 10:17:12 and FAILED the requirements for a valid MOT with 6 comments.

Recorded mileage: 16,613

Recorded mileage: 16,613


ADVISORY

FAIL


MOT TEST: 24 May 2005 12:50:35 PASSED
MOT TEST: 24 May 2005 12:50:35 PASSED

This test (723054645187) was completed on the 24 May 2005 12:50:35 and PASSED the requirements for a valid MOT with 0 comments.

This test (723054645187) was completed on the 24 May 2005 12:50:35 and PASSED the requirements for a valid MOT with 0 comments.

Recorded mileage: 12,003

Recorded mileage: 12,003


MOT TEST: 23 May 2005 16:34:21 FAILED
MOT TEST: 23 May 2005 16:34:21 FAILED

This test (571093545151) was completed on the 23 May 2005 16:34:21 and FAILED the requirements for a valid MOT with 4 comments.

This test (571093545151) was completed on the 23 May 2005 16:34:21 and FAILED the requirements for a valid MOT with 4 comments.

Recorded mileage: 11,983

Recorded mileage: 11,983


FAIL