544 FTT


544FTT is registered to a White 1957, Morris Minor with a Petrol engine. It Failed its most recent MOT Test on the 16 April 2015

3 unique faults (3 Total) reported in its MOT History (5 Tests).

0 common/recurring faults.

60% (3) MOT Pass Rate and a 40% (2) MOT Failure Rate.

24,421 recorded miles.

544 FTT


544FTT is registered to a White 1957, Morris Minor with a Petrol engine. It Failed its most recent MOT Test on the 16 April 2015

3 unique faults (3 Total) reported in its MOT History (5 Tests).

0 common/recurring faults.

60% (3) MOT Pass Rate and a 40% (2) MOT Failure Rate.

24,421 recorded miles.

MOT PASS/Failure rate for 544 FTT

all MOT test results for 544 FTT represented as a percentage
MOT PASS/Failure rate for 544 FTT
all MOT test results for 544 FTT represented as a percentage

PERCENTAGE OF VEHICLE FAULTS WITH 544 FTT

ALL REPORTED FAULTS, DISPLAYED BY PERCENTAGE OF OCCURRENCE DURING ALL MOT TESTS
PERCENTAGE OF VEHICLE FAULTS WITH 544 FTT
ALL REPORTED FAULTS, DISPLAYED BY PERCENTAGE OF OCCURRENCE DURING ALL MOT TESTS
FAIL

544 FTT annual Faults by type

ALL REPORTED FAULTS, DISPLAYED over time and categorised by type
544 FTT annual Faults by type
ALL REPORTED FAULTS, DISPLAYED over time and categorised by type

ALL 544 FTT Failure Faults [3]

ALL Failure faults, ORDERED by OCCURRENCE DURING 544 FTT's MOT HISTORY
ALL 544 FTT Failure Faults [3]
ALL Failure faults, ORDERED by OCCURRENCE DURING 544 FTT's MOT HISTORY
Fail Faults | source www.vehiclestats.co.uk
Fault Fault Test Date Test Date/Time Reference MOT Test Reference
1 Direction indicators not working (1.4.a.2c) Direction indicators not working (1.4.a.2c) 16 April 2015 [09:12] 16/04/2015 727396105121 727396105121
1 Nearside front vehicle structure has excessive corrosion which adversely affects braking or steering (6.1.a.1) Nearside front vehicle structure has excessive corrosion which adversely affects braking or steering (6.1.a.1) 29 April 2014 [15:38] 29/04/2014 635419714183 635419714183
1 Offside rear vehicle structure has excessive corrosion, seriously affecting its strength within 30cm of the body mountings (6.1.b.2) Offside rear vehicle structure has excessive corrosion, seriously affecting its strength within 30cm of the body mountings (6.1.b.2) 29 April 2014 [15:38] 29/04/2014 635419714183 635419714183

MOT TEST: 16 April 2015 14:26:24 PASSED
MOT TEST: 16 April 2015 14:26:24 PASSED

This test (217356805405) was completed on the 16 April 2015 14:26:24 and PASSED the requirements for a valid MOT with 0 comments.

This test (217356805405) was completed on the 16 April 2015 14:26:24 and PASSED the requirements for a valid MOT with 0 comments.

Recorded mileage: 24,421

Recorded mileage: 24,421


MOT TEST: 16 April 2015 09:12:03 FAILED
MOT TEST: 16 April 2015 09:12:03 FAILED

This test (727396105121) was completed on the 16 April 2015 09:12:03 and FAILED the requirements for a valid MOT with 1 comments.

This test (727396105121) was completed on the 16 April 2015 09:12:03 and FAILED the requirements for a valid MOT with 1 comments.

Recorded mileage: 24,421

Recorded mileage: 24,421


FAIL


MOT TEST: 30 April 2014 13:20:20 PASSED
MOT TEST: 30 April 2014 13:20:20 PASSED

This test (935090624129) was completed on the 30 April 2014 13:20:20 and PASSED the requirements for a valid MOT with 0 comments.

This test (935090624129) was completed on the 30 April 2014 13:20:20 and PASSED the requirements for a valid MOT with 0 comments.

Recorded mileage: 24,082

Recorded mileage: 24,082


MOT TEST: 29 April 2014 15:38:02 FAILED
MOT TEST: 29 April 2014 15:38:02 FAILED

This test (635419714183) was completed on the 29 April 2014 15:38:02 and FAILED the requirements for a valid MOT with 2 comments.

This test (635419714183) was completed on the 29 April 2014 15:38:02 and FAILED the requirements for a valid MOT with 2 comments.

Recorded mileage: 24,082

Recorded mileage: 24,082


FAIL


MOT TEST: 05 January 2012 10:42:24 PASSED
MOT TEST: 05 January 2012 10:42:24 PASSED

This test (348575202037) was completed on the 05 January 2012 10:42:24 and PASSED the requirements for a valid MOT with 0 comments.

This test (348575202037) was completed on the 05 January 2012 10:42:24 and PASSED the requirements for a valid MOT with 0 comments.

Recorded mileage: 23,278

Recorded mileage: 23,278