545 PPD


545PPD is registered to a Black 1960, Morris Minor with a Petrol engine. It Failed its most recent MOT Test on the 27 November 2017

49 unique faults (58 Total) reported in its MOT History (19 Tests).

7 common/recurring faults, the most frequent (3 times) is: Offside Rear Mechanical brake component has restricted free movement (3.5.1k).

53% (10) MOT Pass Rate and a 47% (9) MOT Failure Rate.

81,728 recorded miles.

545 PPD


545PPD is registered to a Black 1960, Morris Minor with a Petrol engine. It Failed its most recent MOT Test on the 27 November 2017

49 unique faults (58 Total) reported in its MOT History (19 Tests).

7 common/recurring faults, the most frequent (3 times) is: Offside Rear Mechanical brake component has restricted free movement (3.5.1k).

53% (10) MOT Pass Rate and a 47% (9) MOT Failure Rate.

81,728 recorded miles.

MOT PASS/Failure rate for 545 PPD

all MOT test results for 545 PPD represented as a percentage
MOT PASS/Failure rate for 545 PPD
all MOT test results for 545 PPD represented as a percentage

PERCENTAGE OF VEHICLE FAULTS WITH 545 PPD

ALL REPORTED FAULTS, DISPLAYED BY PERCENTAGE OF OCCURRENCE DURING ALL MOT TESTS
PERCENTAGE OF VEHICLE FAULTS WITH 545 PPD
ALL REPORTED FAULTS, DISPLAYED BY PERCENTAGE OF OCCURRENCE DURING ALL MOT TESTS
ADVISORY

FAIL

PASS WITH RECTIFICATION

545 PPD annual Faults by type

ALL REPORTED FAULTS, DISPLAYED over time and categorised by type
545 PPD annual Faults by type
ALL REPORTED FAULTS, DISPLAYED over time and categorised by type

RECURRING FAULTS WITH 545 PPD

FAULTS THAT HAVE OCCURED MORE THAN ONCE DURING 545 PPD's MOT HISTORY
RECURRING FAULTS WITH 545 PPD
FAULTS THAT HAVE OCCURED MORE THAN ONCE DURING 545 PPD's MOT HISTORY
Fault Fault Test Date Test Date/Time Reference MOT Test Reference
3 Offside rear mechanical brake component has restricted free movement (3.5.1k) Offside rear mechanical brake component has restricted free movement (3.5.1k) 25 November 2017 [10:14] 25/11/2017 03 October 2017 [12:05] 03/10/2017 30 August 2013 [14:53] 30/08/2013 751253612736 751253612736 336485895490 336485895490 568302743273 568302743273
2 Nearside rear mechanical brake component has restricted free movement (3.5.1k) Nearside rear mechanical brake component has restricted free movement (3.5.1k) 25 November 2017 [10:14] 25/11/2017 03 October 2017 [12:05] 03/10/2017 751253612736 751253612736 336485895490 336485895490
2 Nearside rear vehicle structure has excessive corrosion, seriously affecting its strength within 30cm of the body mountings (6.1.b.2) Nearside rear vehicle structure has excessive corrosion, seriously affecting its strength within 30cm of the body mountings (6.1.b.2) 03 October 2017 [12:05] 03/10/2017 08 March 2012 [15:24] 08/03/2012 336485895490 336485895490 619188462069 619188462069
2 Nearside front vehicle structure has excessive corrosion, seriously affecting its strength within 30cm of the body mountings (6.1.b.2) Nearside front vehicle structure has excessive corrosion, seriously affecting its strength within 30cm of the body mountings (6.1.b.2) 03 October 2017 [12:05] 03/10/2017 19 November 2008 [09:28] 19/11/2008 336485895490 336485895490 491584128479 491584128479
2 Parking brake: efficiency below requirements (3.7.b.7) Parking brake: efficiency below requirements (3.7.b.7) 03 October 2017 [12:05] 03/10/2017 31 January 2011 [13:17] 31/01/2011 336485895490 336485895490 176961331421 176961331421
2 Brakes imbalanced across an axle (3.7.b.5b) Brakes imbalanced across an axle (3.7.b.5b) 26 September 2014 [10:10] 26/09/2014 31 January 2011 [13:17] 31/01/2011 317559064206 317559064206 176961331421 176961331421
2 Nearside front vehicle structure has excessive corrosion which adversely affects braking or steering (6.1.a.1) Nearside front vehicle structure has excessive corrosion which adversely affects braking or steering (6.1.a.1) 26 September 2007 [13:27] 26/09/2007 16 April 2007 [16:44] 16/04/2007 480809167203 480809167203 660956007182 660956007182

ALL 545 PPD ADVISORIES [3]

ALL ADVISORIES, ORDERED by OCCURRENCE DURING 545 PPD's MOT HISTORY
ALL 545 PPD ADVISORIES [3]
ALL ADVISORIES, ORDERED by OCCURRENCE DURING 545 PPD's MOT HISTORY
Fail Faults | source www.vehiclestats.co.uk
Fault Fault Test Date Test Date/Time Reference MOT Test Reference
1 Rear exhaust has part of the system slightly deteriorated (7.1.1a) Rear exhaust has part of the system slightly deteriorated (7.1.1a) 31 January 2011 [13:17] 31/01/2011 176961331421 176961331421
1 Rear body has slight corrosion (6.1.b.2) Rear body has slight corrosion (6.1.b.2) 31 January 2011 [13:17] 31/01/2011 176961331421 176961331421
1 Nearside front wheel bearing has slight play (2.5.a.3c) Nearside front wheel bearing has slight play (2.5.a.3c) 25 November 2009 [09:21] 25/11/2009 562499729359 562499729359

ALL 545 PPD Failure Faults [49]

ALL Failure faults, ORDERED by OCCURRENCE DURING 545 PPD's MOT HISTORY
ALL 545 PPD Failure Faults [49]
ALL Failure faults, ORDERED by OCCURRENCE DURING 545 PPD's MOT HISTORY
Fail Faults | source www.vehiclestats.co.uk
Fault Fault Test Date Test Date/Time Reference MOT Test Reference
3 Offside rear mechanical brake component has restricted free movement (3.5.1k) Offside rear mechanical brake component has restricted free movement (3.5.1k) 25 November 2017 [10:14] 25/11/2017 03 October 2017 [12:05] 03/10/2017 30 August 2013 [14:53] 30/08/2013 751253612736 751253612736 336485895490 336485895490 568302743273 568302743273
2 Nearside rear mechanical brake component has restricted free movement (3.5.1k) Nearside rear mechanical brake component has restricted free movement (3.5.1k) 25 November 2017 [10:14] 25/11/2017 03 October 2017 [12:05] 03/10/2017 751253612736 751253612736 336485895490 336485895490
2 Nearside rear vehicle structure has excessive corrosion, seriously affecting its strength within 30cm of the body mountings (6.1.b.2) Nearside rear vehicle structure has excessive corrosion, seriously affecting its strength within 30cm of the body mountings (6.1.b.2) 03 October 2017 [12:05] 03/10/2017 08 March 2012 [15:24] 08/03/2012 336485895490 336485895490 619188462069 619188462069
2 Nearside front vehicle structure has excessive corrosion, seriously affecting its strength within 30cm of the body mountings (6.1.b.2) Nearside front vehicle structure has excessive corrosion, seriously affecting its strength within 30cm of the body mountings (6.1.b.2) 03 October 2017 [12:05] 03/10/2017 19 November 2008 [09:28] 19/11/2008 336485895490 336485895490 491584128479 491584128479
2 Parking brake: efficiency below requirements (3.7.b.7) Parking brake: efficiency below requirements (3.7.b.7) 03 October 2017 [12:05] 03/10/2017 31 January 2011 [13:17] 31/01/2011 336485895490 336485895490 176961331421 176961331421
2 Brakes imbalanced across an axle (3.7.b.5b) Brakes imbalanced across an axle (3.7.b.5b) 26 September 2014 [10:10] 26/09/2014 31 January 2011 [13:17] 31/01/2011 317559064206 317559064206 176961331421 176961331421
1 Offside front vehicle structure has excessive corrosion which adversely affects braking or steering (6.1.a.1) Offside front vehicle structure has excessive corrosion which adversely affects braking or steering (6.1.a.1) 25 November 2017 [10:14] 25/11/2017 751253612736 751253612736
1 Offside vehicle structure has an unsatisfactory modification, seriously affecting its strength within 30cm of the body mountings (6.1.b.2) Offside vehicle structure has an unsatisfactory modification, seriously affecting its strength within 30cm of the body mountings (6.1.b.2) 25 November 2017 [10:14] 25/11/2017 751253612736 751253612736
1 Offside rear leaf spring shackle bracket corroded and seriously weakened (2.4.b.6d) Offside rear leaf spring shackle bracket corroded and seriously weakened (2.4.b.6d) 25 November 2017 [10:14] 25/11/2017 751253612736 751253612736
1 Nearside rear leaf spring shackle bracket corroded and seriously weakened (2.4.b.6d) Nearside rear leaf spring shackle bracket corroded and seriously weakened (2.4.b.6d) 25 November 2017 [10:14] 25/11/2017 751253612736 751253612736
1 Nearside rear suspension component mounting prescribed area is excessively corroded inner seal / leaf spring eye (2.4.a.3) Nearside rear suspension component mounting prescribed area is excessively corroded inner seal / leaf spring eye (2.4.a.3) 25 November 2017 [10:14] 25/11/2017 751253612736 751253612736
1 Rear position lamp(s) not working both sides (1.1.a.3b) Rear position lamp(s) not working both sides (1.1.a.3b) 25 November 2017 [10:14] 25/11/2017 751253612736 751253612736
1 Rear brakes imbalanced across an axle axle 2 (3.7.b.5b) Rear brakes imbalanced across an axle axle 2 (3.7.b.5b) 25 November 2017 [10:14] 25/11/2017 751253612736 751253612736
1 Offside rear vehicle structure is damaged, seriously affecting its strength within 30cm of the body mountings (6.1.b.2) Offside rear vehicle structure is damaged, seriously affecting its strength within 30cm of the body mountings (6.1.b.2) 03 October 2017 [12:05] 03/10/2017 336485895490 336485895490
1 Offside front vehicle structure has excessive corrosion, seriously affecting its strength within 30cm of the body mountings (6.1.b.2) Offside front vehicle structure has excessive corrosion, seriously affecting its strength within 30cm of the body mountings (6.1.b.2) 03 October 2017 [12:05] 03/10/2017 336485895490 336485895490
1 Nearside rear position lamp(s) not working (1.1.a.3b) Nearside rear position lamp(s) not working (1.1.a.3b) 03 October 2017 [12:05] 03/10/2017 336485895490 336485895490
1 Offside rear rear position lamp(s) not working (1.1.a.3b) Offside rear rear position lamp(s) not working (1.1.a.3b) 03 October 2017 [12:05] 03/10/2017 336485895490 336485895490
1 Mechanical brake component has restricted free movement (3.5.1k) Mechanical brake component has restricted free movement (3.5.1k) 03 October 2017 [12:05] 03/10/2017 336485895490 336485895490
1 Service brake: efficiency below requirements (3.7.b.7) Service brake: efficiency below requirements (3.7.b.7) 03 October 2017 [12:05] 03/10/2017 336485895490 336485895490
1 Offside rear suspension has inadequate clearance with the chassis (2.4.a.1a) Offside rear suspension has inadequate clearance with the chassis (2.4.a.1a) 26 September 2014 [10:10] 26/09/2014 317559064206 317559064206
1 Offside rear vehicle structure has excessive corrosion, seriously affecting its strength within 30cm of the body mountings (6.1.b.2) Offside rear vehicle structure has excessive corrosion, seriously affecting its strength within 30cm of the body mountings (6.1.b.2) 26 September 2014 [10:10] 26/09/2014 317559064206 317559064206
1 Indicator tell tale inoperative (1.4.a.2a) Indicator tell tale inoperative (1.4.a.2a) 30 August 2013 [14:53] 30/08/2013 568302743273 568302743273
1 Steering column top bearing excessively worn (2.1.2c) Steering column top bearing excessively worn (2.1.2c) 30 August 2013 [14:53] 30/08/2013 568302743273 568302743273
1 Exhaust system not adequately supported (7.1.1) Exhaust system not adequately supported (7.1.1) 30 August 2013 [14:53] 30/08/2013 568302743273 568302743273
1 Nearside front front wheel bearing has excessive play (2.5.a.3c) Nearside front front wheel bearing has excessive play (2.5.a.3c) 30 August 2013 [14:53] 30/08/2013 568302743273 568302743273
1 Nearside front front suspension has excessive play in a lower suspension ball joint (2.5.b.1a) Nearside front front suspension has excessive play in a lower suspension ball joint (2.5.b.1a) 30 August 2013 [14:53] 30/08/2013 568302743273 568302743273
1 Nearside front seat belt anchorage prescribed area is excessively corroded (5.2.6) Nearside front seat belt anchorage prescribed area is excessively corroded (5.2.6) 08 March 2012 [15:24] 08/03/2012 619188462069 619188462069
1 Offside rear tyre tread depth below requirements of 1.6mm (4.1.e.1) Offside rear tyre tread depth below requirements of 1.6mm (4.1.e.1) 31 January 2011 [13:17] 31/01/2011 176961331421 176961331421
1 Nearside front tyre has a lump, caused by separation or partial failure of its structure (4.1.d.1b) Nearside front tyre has a lump, caused by separation or partial failure of its structure (4.1.d.1b) 31 January 2011 [13:17] 31/01/2011 176961331421 176961331421
1 Brake pedal spongy (3.3.b.1b) Brake pedal spongy (3.3.b.1b) 19 November 2008 [09:28] 19/11/2008 491584128479 491584128479
1 Steering column movement between the shaft and steering wheel (2.1.2b) Steering column movement between the shaft and steering wheel (2.1.2b) 19 November 2008 [09:28] 19/11/2008 491584128479 491584128479
1 Nearside front brake pipe excessively corroded (3.6.b.2c) Nearside front brake pipe excessively corroded (3.6.b.2c) 26 September 2007 [13:27] 26/09/2007 480809167203 480809167203
1 Offside front brake pipe stretched (found during steering lock to lock check) (2.2.d.2b) Offside front brake pipe stretched (found during steering lock to lock check) (2.2.d.2b) 26 September 2007 [13:27] 26/09/2007 480809167203 480809167203
1 Centre brake pipe excessively corroded (3.6.b.2c) Centre brake pipe excessively corroded (3.6.b.2c) 26 September 2007 [13:27] 26/09/2007 480809167203 480809167203
1 Centre vehicle structure has excessive corrosion which adversely affects braking or steering (6.1.a.1) Centre vehicle structure has excessive corrosion which adversely affects braking or steering (6.1.a.1) 26 September 2007 [13:27] 26/09/2007 480809167203 480809167203
1 Nearside front vehicle structure has excessive corrosion which adversely affects braking or steering (6.1.a.1) Nearside front vehicle structure has excessive corrosion which adversely affects braking or steering (6.1.a.1) 26 September 2007 [13:27] 26/09/2007 480809167203 480809167203
1 Offside rear vehicle structure has excessive corrosion which adversely affects braking or steering (6.1.a.1) Offside rear vehicle structure has excessive corrosion which adversely affects braking or steering (6.1.a.1) 26 September 2007 [13:27] 26/09/2007 480809167203 480809167203
1 Nearside stop lamp not working (1.2.1b) Nearside stop lamp not working (1.2.1b) 26 September 2007 [13:27] 26/09/2007 480809167203 480809167203
1 Offside windscreen wiper does not clear the windscreen effectively (8.2.2) Offside windscreen wiper does not clear the windscreen effectively (8.2.2) 26 September 2007 [13:27] 26/09/2007 480809167203 480809167203
1 Nearside windscreen wiper does not clear the windscreen effectively (8.2.2) Nearside windscreen wiper does not clear the windscreen effectively (8.2.2) 26 September 2007 [13:27] 26/09/2007 480809167203 480809167203
1 Offside rear rear brake recording little or no effort (3.7.b.5a) Offside rear rear brake recording little or no effort (3.7.b.5a) 26 September 2007 [13:27] 26/09/2007 480809167203 480809167203

ALL 545 PPD Pass With Rectification Faults [6]

ALL Pass With Rectification faults, ORDERED by OCCURRENCE DURING 545 PPD's MOT HISTORY
ALL 545 PPD Pass With Rectification Faults [6]
ALL Pass With Rectification faults, ORDERED by OCCURRENCE DURING 545 PPD's MOT HISTORY
Pass With Rectification Faults | source www.vehiclestats.co.uk
Fault Fault Test Date Test Date/Time Reference MOT Test Reference
1 Offside rear suspension spring mounting prescribed area is excessively corroded (2.4.a.3) Offside rear suspension spring mounting prescribed area is excessively corroded (2.4.a.3) 16 April 2007 [16:44] 16/04/2007 660956007182 660956007182
1 Nearside rear suspension arm locating pin locking device missing (2.4.g.3b) Nearside rear suspension arm locating pin locking device missing (2.4.g.3b) 16 April 2007 [16:44] 16/04/2007 660956007182 660956007182
1 Offside rear suspension arm locating pin locking device missing (2.4.g.3b) Offside rear suspension arm locating pin locking device missing (2.4.g.3b) 16 April 2007 [16:44] 16/04/2007 660956007182 660956007182
1 Centre subframe mounting prescribed area is excessively corroded (2.4.a.3) Centre subframe mounting prescribed area is excessively corroded (2.4.a.3) 16 April 2007 [16:44] 16/04/2007 660956007182 660956007182
1 Nearside front vehicle structure has excessive corrosion which adversely affects braking or steering (6.1.a.1) Nearside front vehicle structure has excessive corrosion which adversely affects braking or steering (6.1.a.1) 16 April 2007 [16:44] 16/04/2007 660956007182 660956007182
1 Front brake application uneven (3.7.b.2) Front brake application uneven (3.7.b.2) 16 April 2007 [16:44] 16/04/2007 660956007182 660956007182

MOT TEST: 27 November 2017 14:37:40 PASSED
MOT TEST: 27 November 2017 14:37:40 PASSED

This test (672407392428) was completed on the 27 November 2017 14:37:40 and PASSED the requirements for a valid MOT with 0 comments.

This test (672407392428) was completed on the 27 November 2017 14:37:40 and PASSED the requirements for a valid MOT with 0 comments.

Recorded mileage: 81,728

Recorded mileage: 81,728


MOT TEST: 25 November 2017 10:14:58 FAILED
MOT TEST: 25 November 2017 10:14:58 FAILED

This test (751253612736) was completed on the 25 November 2017 10:14:58 and FAILED the requirements for a valid MOT with 9 comments.

This test (751253612736) was completed on the 25 November 2017 10:14:58 and FAILED the requirements for a valid MOT with 9 comments.

Recorded mileage: 81,728

Recorded mileage: 81,728


FAIL


MOT TEST: 03 October 2017 12:05:36 FAILED
MOT TEST: 03 October 2017 12:05:36 FAILED

This test (336485895490) was completed on the 03 October 2017 12:05:36 and FAILED the requirements for a valid MOT with 12 comments.

This test (336485895490) was completed on the 03 October 2017 12:05:36 and FAILED the requirements for a valid MOT with 12 comments.

Recorded mileage: 81,728

Recorded mileage: 81,728


FAIL


MOT TEST: 06 August 2015 14:29:21 PASSED
MOT TEST: 06 August 2015 14:29:21 PASSED

This test (842189085074) was completed on the 06 August 2015 14:29:21 and PASSED the requirements for a valid MOT with 0 comments.

This test (842189085074) was completed on the 06 August 2015 14:29:21 and PASSED the requirements for a valid MOT with 0 comments.

Recorded mileage: 81,728

Recorded mileage: 81,728


MOT TEST: 06 October 2014 16:51:19 PASSED
MOT TEST: 06 October 2014 16:51:19 PASSED

This test (919089874287) was completed on the 06 October 2014 16:51:19 and PASSED the requirements for a valid MOT with 0 comments.

This test (919089874287) was completed on the 06 October 2014 16:51:19 and PASSED the requirements for a valid MOT with 0 comments.

Recorded mileage: 81,728

Recorded mileage: 81,728


MOT TEST: 26 September 2014 10:10:35 FAILED
MOT TEST: 26 September 2014 10:10:35 FAILED

This test (317559064206) was completed on the 26 September 2014 10:10:35 and FAILED the requirements for a valid MOT with 3 comments.

This test (317559064206) was completed on the 26 September 2014 10:10:35 and FAILED the requirements for a valid MOT with 3 comments.

Recorded mileage: 81,728

Recorded mileage: 81,728


FAIL


MOT TEST: 18 September 2013 17:24:54 PASSED
MOT TEST: 18 September 2013 17:24:54 PASSED

This test (325091463203) was completed on the 18 September 2013 17:24:54 and PASSED the requirements for a valid MOT with 0 comments.

This test (325091463203) was completed on the 18 September 2013 17:24:54 and PASSED the requirements for a valid MOT with 0 comments.

Recorded mileage: 81,728

Recorded mileage: 81,728


MOT TEST: 30 August 2013 14:53:22 FAILED
MOT TEST: 30 August 2013 14:53:22 FAILED

This test (568302743273) was completed on the 30 August 2013 14:53:22 and FAILED the requirements for a valid MOT with 6 comments.

This test (568302743273) was completed on the 30 August 2013 14:53:22 and FAILED the requirements for a valid MOT with 6 comments.

Recorded mileage: 81,728

Recorded mileage: 81,728


FAIL


MOT TEST: 13 March 2012 14:39:45 PASSED
MOT TEST: 13 March 2012 14:39:45 PASSED

This test (968253572009) was completed on the 13 March 2012 14:39:45 and PASSED the requirements for a valid MOT with 0 comments.

This test (968253572009) was completed on the 13 March 2012 14:39:45 and PASSED the requirements for a valid MOT with 0 comments.

Recorded mileage: 81,728

Recorded mileage: 81,728


MOT TEST: 08 March 2012 15:24:58 FAILED
MOT TEST: 08 March 2012 15:24:58 FAILED

This test (619188462069) was completed on the 08 March 2012 15:24:58 and FAILED the requirements for a valid MOT with 2 comments.

This test (619188462069) was completed on the 08 March 2012 15:24:58 and FAILED the requirements for a valid MOT with 2 comments.

Recorded mileage: 81,728

Recorded mileage: 81,728


FAIL


MOT TEST: 01 February 2011 12:12:35 PASSED
MOT TEST: 01 February 2011 12:12:35 PASSED

This test (237512931016) was completed on the 01 February 2011 12:12:35 and PASSED the requirements for a valid MOT with 0 comments.

This test (237512931016) was completed on the 01 February 2011 12:12:35 and PASSED the requirements for a valid MOT with 0 comments.

Recorded mileage: 81,728

Recorded mileage: 81,728


MOT TEST: 31 January 2011 13:17:55 FAILED
MOT TEST: 31 January 2011 13:17:55 FAILED

This test (176961331421) was completed on the 31 January 2011 13:17:55 and FAILED the requirements for a valid MOT with 6 comments.

This test (176961331421) was completed on the 31 January 2011 13:17:55 and FAILED the requirements for a valid MOT with 6 comments.

Recorded mileage: 81,728

Recorded mileage: 81,728


ADVISORY

FAIL


MOT TEST: 25 November 2009 09:21:04 PASSED
MOT TEST: 25 November 2009 09:21:04 PASSED

This test (562499729359) was completed on the 25 November 2009 09:21:04 and PASSED the requirements for a valid MOT with 1 comments.

This test (562499729359) was completed on the 25 November 2009 09:21:04 and PASSED the requirements for a valid MOT with 1 comments.

Recorded mileage: 81,728

Recorded mileage: 81,728


ADVISORY


MOT TEST: 20 November 2008 14:55:26 PASSED
MOT TEST: 20 November 2008 14:55:26 PASSED

This test (211295628398) was completed on the 20 November 2008 14:55:26 and PASSED the requirements for a valid MOT with 0 comments.

This test (211295628398) was completed on the 20 November 2008 14:55:26 and PASSED the requirements for a valid MOT with 0 comments.

Recorded mileage: 81,728

Recorded mileage: 81,728


MOT TEST: 19 November 2008 09:28:52 FAILED
MOT TEST: 19 November 2008 09:28:52 FAILED

This test (491584128479) was completed on the 19 November 2008 09:28:52 and FAILED the requirements for a valid MOT with 3 comments.

This test (491584128479) was completed on the 19 November 2008 09:28:52 and FAILED the requirements for a valid MOT with 3 comments.

Recorded mileage: 81,728

Recorded mileage: 81,728


FAIL


MOT TEST: 17 October 2007 09:09:14 PASSED
MOT TEST: 17 October 2007 09:09:14 PASSED

This test (333800397266) was completed on the 17 October 2007 09:09:14 and PASSED the requirements for a valid MOT with 0 comments.

This test (333800397266) was completed on the 17 October 2007 09:09:14 and PASSED the requirements for a valid MOT with 0 comments.

Recorded mileage: 81,728

Recorded mileage: 81,728


MOT TEST: 26 September 2007 13:27:15 FAILED
MOT TEST: 26 September 2007 13:27:15 FAILED

This test (480809167203) was completed on the 26 September 2007 13:27:15 and FAILED the requirements for a valid MOT with 10 comments.

This test (480809167203) was completed on the 26 September 2007 13:27:15 and FAILED the requirements for a valid MOT with 10 comments.

Recorded mileage: 81,728

Recorded mileage: 81,728


FAIL


MOT TEST: 16 April 2007 16:44:30 PASSED
MOT TEST: 16 April 2007 16:44:30 PASSED

This test (100856007166) was completed on the 16 April 2007 16:44:30 and PASSED the requirements for a valid MOT with 0 comments.

This test (100856007166) was completed on the 16 April 2007 16:44:30 and PASSED the requirements for a valid MOT with 0 comments.

Recorded mileage: 81,728

Recorded mileage: 81,728


MOT TEST: 16 April 2007 16:44:30 FAILED
MOT TEST: 16 April 2007 16:44:30 FAILED

This test (660956007182) was completed on the 16 April 2007 16:44:30 and FAILED the requirements for a valid MOT with 6 comments.

This test (660956007182) was completed on the 16 April 2007 16:44:30 and FAILED the requirements for a valid MOT with 6 comments.

Recorded mileage: 81,728

Recorded mileage: 81,728


PASS WITH RECTIFICATION