563 HCY


563HCY is registered to a Grey 1964, Morris Oxford with a Petrol engine. It Failed its most recent MOT Test on the 02 December 2017

15 unique faults (16 Total) reported in its MOT History (14 Tests).

1 common/recurring faults.

64% (9) MOT Pass Rate and a 36% (5) MOT Failure Rate.

10,552 recorded miles.

563 HCY


563HCY is registered to a Grey 1964, Morris Oxford with a Petrol engine. It Failed its most recent MOT Test on the 02 December 2017

15 unique faults (16 Total) reported in its MOT History (14 Tests).

1 common/recurring faults.

64% (9) MOT Pass Rate and a 36% (5) MOT Failure Rate.

10,552 recorded miles.

MOT PASS/Failure rate for 563 HCY

all MOT test results for 563 HCY represented as a percentage
MOT PASS/Failure rate for 563 HCY
all MOT test results for 563 HCY represented as a percentage

PERCENTAGE OF VEHICLE FAULTS WITH 563 HCY

ALL REPORTED FAULTS, DISPLAYED BY PERCENTAGE OF OCCURRENCE DURING ALL MOT TESTS
PERCENTAGE OF VEHICLE FAULTS WITH 563 HCY
ALL REPORTED FAULTS, DISPLAYED BY PERCENTAGE OF OCCURRENCE DURING ALL MOT TESTS
ADVISORY

FAIL

USER ENTERED

563 HCY annual Faults by type

ALL REPORTED FAULTS, DISPLAYED over time and categorised by type
563 HCY annual Faults by type
ALL REPORTED FAULTS, DISPLAYED over time and categorised by type

ALL 563 HCY ADVISORIES [3]

ALL ADVISORIES, ORDERED by OCCURRENCE DURING 563 HCY's MOT HISTORY
ALL 563 HCY ADVISORIES [3]
ALL ADVISORIES, ORDERED by OCCURRENCE DURING 563 HCY's MOT HISTORY
Advisory Faults | source www.vehiclestats.co.uk
Fault Fault Test Date Test Date/Time Reference MOT Test Reference
1 Front exhaust has a minor leak of exhaust gases (7.1.2) Front exhaust has a minor leak of exhaust gases (7.1.2) 02 December 2017 [11:52] 02/12/2017 431976229629 431976229629
1 Offside drag link end ball joint has slight play (2.2.b.1f) Offside drag link end ball joint has slight play (2.2.b.1f) 12 November 2008 [16:57] 12/11/2008 462747218438 462747218438
1 Nearside steering pivot point has slight play (2.2.b.1g) Nearside steering pivot point has slight play (2.2.b.1g) 12 November 2008 [16:57] 12/11/2008 462747218438 462747218438

ALL 563 HCY Failure Faults [10]

ALL Failure faults, ORDERED by OCCURRENCE DURING 563 HCY's MOT HISTORY
ALL 563 HCY Failure Faults [10]
ALL Failure faults, ORDERED by OCCURRENCE DURING 563 HCY's MOT HISTORY
Fail Faults | source www.vehiclestats.co.uk
Fault Fault Test Date Test Date/Time Reference MOT Test Reference
1 Windscreen wiper not operating automatically when switched on (8.2.1b) Windscreen wiper not operating automatically when switched on (8.2.1b) 10 November 2016 [17:18] 10/11/2016 153919973519 153919973519
1 Exhaust has a major leak of exhaust gases (7.1.2) Exhaust has a major leak of exhaust gases (7.1.2) 16 September 2015 [11:24] 16/09/2015 396734310787 396734310787
1 Nearside rear suspension spring mounting prescribed area is excessively corroded (2.4.a.3) Nearside rear suspension spring mounting prescribed area is excessively corroded (2.4.a.3) 16 September 2015 [11:24] 16/09/2015 396734310787 396734310787
1 Nearside front lower bonded suspension unit deteriorated and cannot function as intended (2.4.f.3) Nearside front lower bonded suspension unit deteriorated and cannot function as intended (2.4.f.3) 03 May 2011 [14:08] 03/05/2011 545663821118 545663821118
1 Offside front lower bonded suspension unit deteriorated and cannot function as intended (2.4.f.3) Offside front lower bonded suspension unit deteriorated and cannot function as intended (2.4.f.3) 03 May 2011 [14:08] 03/05/2011 545663821118 545663821118
1 Front exhaust has a major leak of exhaust gases (7.1.2) Front exhaust has a major leak of exhaust gases (7.1.2) 03 May 2011 [14:08] 03/05/2011 545663821118 545663821118
1 Nearside steering pivot point has excessive play (2.2.b.1g) Nearside steering pivot point has excessive play (2.2.b.1g) 03 May 2011 [14:08] 03/05/2011 545663821118 545663821118
1 Registration plate lamp not working (1.1.c.1d) Registration plate lamp not working (1.1.c.1d) 03 May 2011 [14:08] 03/05/2011 545663821118 545663821118
1 Nearside front suspension component mounting prescribed area is excessively corroded (2.4.a.3) Nearside front suspension component mounting prescribed area is excessively corroded (2.4.a.3) 11 November 2009 [16:31] 11/11/2009 363175119350 363175119350
1 Offside front brake hose seriously damaged (found during steering lock to lock check) (2.2.d.2b) Offside front brake hose seriously damaged (found during steering lock to lock check) (2.2.d.2b) 16 November 2005 [11:02] 16/11/2005 490200725449 490200725449

ALL 563 HCY User Entered Faults [3]

ALL User Entered faults, ORDERED by OCCURRENCE DURING 563 HCY's MOT HISTORY
ALL 563 HCY User Entered Faults [3]
ALL User Entered faults, ORDERED by OCCURRENCE DURING 563 HCY's MOT HISTORY
User Entered Faults | source www.vehiclestats.co.uk
Fault Fault Test Date Test Date/Time Reference MOT Test Reference
2 Extensive welding repairs Extensive welding repairs 18 November 2009 [16:48] 18/11/2009 11 November 2009 [16:31] 11/11/2009 251142529302 251142529302 363175119350 363175119350
1 Extensive repairs all over under body of vehicle Extensive repairs all over under body of vehicle 08 November 2007 [10:26] 08/11/2007 734792717368 734792717368

MOT TEST: 02 December 2017 11:52:55 PASSED
MOT TEST: 02 December 2017 11:52:55 PASSED

This test (431976229629) was completed on the 02 December 2017 11:52:55 and PASSED the requirements for a valid MOT with 1 comments.

This test (431976229629) was completed on the 02 December 2017 11:52:55 and PASSED the requirements for a valid MOT with 1 comments.

Recorded mileage: 10,552

Recorded mileage: 10,552


ADVISORY


MOT TEST: 15 November 2016 11:19:22 PASSED
MOT TEST: 15 November 2016 11:19:22 PASSED

This test (837660203210) was completed on the 15 November 2016 11:19:22 and PASSED the requirements for a valid MOT with 0 comments.

This test (837660203210) was completed on the 15 November 2016 11:19:22 and PASSED the requirements for a valid MOT with 0 comments.

Recorded mileage: 9,541

Recorded mileage: 9,541


MOT TEST: 10 November 2016 17:18:19 FAILED
MOT TEST: 10 November 2016 17:18:19 FAILED

This test (153919973519) was completed on the 10 November 2016 17:18:19 and FAILED the requirements for a valid MOT with 1 comments.

This test (153919973519) was completed on the 10 November 2016 17:18:19 and FAILED the requirements for a valid MOT with 1 comments.

Recorded mileage: 9,541

Recorded mileage: 9,541


FAIL


MOT TEST: 17 September 2015 10:42:00 PASSED
MOT TEST: 17 September 2015 10:42:00 PASSED

This test (149660340186) was completed on the 17 September 2015 10:42:00 and PASSED the requirements for a valid MOT with 0 comments.

This test (149660340186) was completed on the 17 September 2015 10:42:00 and PASSED the requirements for a valid MOT with 0 comments.

Recorded mileage: 9,276

Recorded mileage: 9,276


MOT TEST: 16 September 2015 11:24:46 FAILED
MOT TEST: 16 September 2015 11:24:46 FAILED

This test (396734310787) was completed on the 16 September 2015 11:24:46 and FAILED the requirements for a valid MOT with 2 comments.

This test (396734310787) was completed on the 16 September 2015 11:24:46 and FAILED the requirements for a valid MOT with 2 comments.

Recorded mileage: 9,272

Recorded mileage: 9,272


FAIL


MOT TEST: 01 June 2011 16:27:00 PASSED
MOT TEST: 01 June 2011 16:27:00 PASSED

This test (218042051115) was completed on the 01 June 2011 16:27:00 and PASSED the requirements for a valid MOT with 0 comments.

This test (218042051115) was completed on the 01 June 2011 16:27:00 and PASSED the requirements for a valid MOT with 0 comments.

Recorded mileage: 8,784

Recorded mileage: 8,784


MOT TEST: 03 May 2011 14:08:13 FAILED
MOT TEST: 03 May 2011 14:08:13 FAILED

This test (545663821118) was completed on the 03 May 2011 14:08:13 and FAILED the requirements for a valid MOT with 5 comments.

This test (545663821118) was completed on the 03 May 2011 14:08:13 and FAILED the requirements for a valid MOT with 5 comments.

Recorded mileage: 8,784

Recorded mileage: 8,784


FAIL


MOT TEST: 18 November 2009 16:48:23 PASSED
MOT TEST: 18 November 2009 16:48:23 PASSED

This test (251142529302) was completed on the 18 November 2009 16:48:23 and PASSED the requirements for a valid MOT with 1 comments.

This test (251142529302) was completed on the 18 November 2009 16:48:23 and PASSED the requirements for a valid MOT with 1 comments.

Recorded mileage: 8,333

Recorded mileage: 8,333


USER ENTERED


MOT TEST: 11 November 2009 16:31:07 FAILED
MOT TEST: 11 November 2009 16:31:07 FAILED

This test (363175119350) was completed on the 11 November 2009 16:31:07 and FAILED the requirements for a valid MOT with 2 comments.

This test (363175119350) was completed on the 11 November 2009 16:31:07 and FAILED the requirements for a valid MOT with 2 comments.

Recorded mileage: 8,305

Recorded mileage: 8,305


FAIL

USER ENTERED


MOT TEST: 12 November 2008 16:57:54 PASSED
MOT TEST: 12 November 2008 16:57:54 PASSED

This test (462747218438) was completed on the 12 November 2008 16:57:54 and PASSED the requirements for a valid MOT with 2 comments.

This test (462747218438) was completed on the 12 November 2008 16:57:54 and PASSED the requirements for a valid MOT with 2 comments.

Recorded mileage: 7,684

Recorded mileage: 7,684


ADVISORY


MOT TEST: 08 November 2007 10:26:10 PASSED
MOT TEST: 08 November 2007 10:26:10 PASSED

This test (734792717368) was completed on the 08 November 2007 10:26:10 and PASSED the requirements for a valid MOT with 1 comments.

This test (734792717368) was completed on the 08 November 2007 10:26:10 and PASSED the requirements for a valid MOT with 1 comments.

Recorded mileage: 6,781

Recorded mileage: 6,781


USER ENTERED


MOT TEST: 14 November 2006 09:28:21 PASSED
MOT TEST: 14 November 2006 09:28:21 PASSED

This test (674768416355) was completed on the 14 November 2006 09:28:21 and PASSED the requirements for a valid MOT with 0 comments.

This test (674768416355) was completed on the 14 November 2006 09:28:21 and PASSED the requirements for a valid MOT with 0 comments.

Recorded mileage: 5,966

Recorded mileage: 5,966


MOT TEST: 16 November 2005 13:52:46 PASSED
MOT TEST: 16 November 2005 13:52:46 PASSED

This test (921480725374) was completed on the 16 November 2005 13:52:46 and PASSED the requirements for a valid MOT with 0 comments.

This test (921480725374) was completed on the 16 November 2005 13:52:46 and PASSED the requirements for a valid MOT with 0 comments.

Recorded mileage: 5,705

Recorded mileage: 5,705


MOT TEST: 16 November 2005 11:02:29 FAILED
MOT TEST: 16 November 2005 11:02:29 FAILED

This test (490200725449) was completed on the 16 November 2005 11:02:29 and FAILED the requirements for a valid MOT with 1 comments.

This test (490200725449) was completed on the 16 November 2005 11:02:29 and FAILED the requirements for a valid MOT with 1 comments.

Recorded mileage: 5,701

Recorded mileage: 5,701


FAIL