563 UXK


563UXK is registered to a Green 1951, Morris Minor with a Petrol engine. It Failed its most recent MOT Test on the 10 March 2011

13 unique faults (13 Total) reported in its MOT History (7 Tests).

0 common/recurring faults.

57% (4) MOT Pass Rate and a 43% (3) MOT Failure Rate.

91,894 recorded miles.

563 UXK


563UXK is registered to a Green 1951, Morris Minor with a Petrol engine. It Failed its most recent MOT Test on the 10 March 2011

13 unique faults (13 Total) reported in its MOT History (7 Tests).

0 common/recurring faults.

57% (4) MOT Pass Rate and a 43% (3) MOT Failure Rate.

91,894 recorded miles.

MOT PASS/Failure rate for 563 UXK

all MOT test results for 563 UXK represented as a percentage
MOT PASS/Failure rate for 563 UXK
all MOT test results for 563 UXK represented as a percentage

PERCENTAGE OF VEHICLE FAULTS WITH 563 UXK

ALL REPORTED FAULTS, DISPLAYED BY PERCENTAGE OF OCCURRENCE DURING ALL MOT TESTS
PERCENTAGE OF VEHICLE FAULTS WITH 563 UXK
ALL REPORTED FAULTS, DISPLAYED BY PERCENTAGE OF OCCURRENCE DURING ALL MOT TESTS
ADVISORY

FAIL

USER ENTERED

563 UXK annual Faults by type

ALL REPORTED FAULTS, DISPLAYED over time and categorised by type
563 UXK annual Faults by type
ALL REPORTED FAULTS, DISPLAYED over time and categorised by type

ALL 563 UXK ADVISORIES [1]

ALL ADVISORIES, ORDERED by OCCURRENCE DURING 563 UXK's MOT HISTORY
ALL 563 UXK ADVISORIES [1]
ALL ADVISORIES, ORDERED by OCCURRENCE DURING 563 UXK's MOT HISTORY
Advisory Faults | source www.vehiclestats.co.uk
Fault Fault Test Date Test Date/Time Reference MOT Test Reference
1 Offside outer front lower suspension arm has slight play in a pin/bush (2.4.g.2) Offside outer front lower suspension arm has slight play in a pin/bush (2.4.g.2) 25 September 2009 [15:08] 25/09/2009 391488969410 391488969410

ALL 563 UXK Failure Faults [10]

ALL Failure faults, ORDERED by OCCURRENCE DURING 563 UXK's MOT HISTORY
ALL 563 UXK Failure Faults [10]
ALL Failure faults, ORDERED by OCCURRENCE DURING 563 UXK's MOT HISTORY
Fail Faults | source www.vehiclestats.co.uk
Fault Fault Test Date Test Date/Time Reference MOT Test Reference
1 Nearside headlamp not working on dipped beam (1.7.5a) Nearside headlamp not working on dipped beam (1.7.5a) 04 March 2011 [16:45] 04/03/2011 469343061084 469343061084
1 Nearside headlamp not working on main beam (1.7.5a) Nearside headlamp not working on main beam (1.7.5a) 04 March 2011 [16:45] 04/03/2011 469343061084 469343061084
1 Horn not working (1.6.2a) Horn not working (1.6.2a) 04 March 2011 [16:45] 04/03/2011 469343061084 469343061084
1 Offside rear suspension spring mounting prescribed area is excessively corroded (2.4.a.3) Offside rear suspension spring mounting prescribed area is excessively corroded (2.4.a.3) 04 March 2011 [16:45] 04/03/2011 469343061084 469343061084
1 Nearside front position lamp(s) not working (1.1.a.3b) Nearside front position lamp(s) not working (1.1.a.3b) 12 February 2008 [11:33] 12/02/2008 453313148042 453313148042
1 Front tyre tread depth below requirements of 1.6mm (4.1.e.1) Front tyre tread depth below requirements of 1.6mm (4.1.e.1) 12 February 2008 [11:33] 12/02/2008 453313148042 453313148042
1 Offside front tie bar/rod insecure (2.4.g.1) Offside front tie bar/rod insecure (2.4.g.1) 12 February 2008 [11:33] 12/02/2008 453313148042 453313148042
1 Offside front direction indicator not working (1.4.a.2c) Offside front direction indicator not working (1.4.a.2c) 22 February 2006 [11:41] 22/02/2006 152323556042 152323556042
1 Fuel hose leaking (7.2.3) Fuel hose leaking (7.2.3) 22 February 2006 [11:41] 22/02/2006 152323556042 152323556042
1 Offside front front brake grabbing severely (3.7.a.2b) Offside front front brake grabbing severely (3.7.a.2b) 22 February 2006 [11:41] 22/02/2006 152323556042 152323556042

ALL 563 UXK User Entered Faults [2]

ALL User Entered faults, ORDERED by OCCURRENCE DURING 563 UXK's MOT HISTORY
ALL 563 UXK User Entered Faults [2]
ALL User Entered faults, ORDERED by OCCURRENCE DURING 563 UXK's MOT HISTORY
Fail Faults | source www.vehiclestats.co.uk
Fault Fault Test Date Test Date/Time Reference MOT Test Reference
1 N/s/r tyre side wall cracked N/s/r tyre side wall cracked 12 February 2008 [11:33] 12/02/2008 453313148042 453313148042
1 Oil leak from n/s/r half shaft Oil leak from n/s/r half shaft 12 February 2008 [11:33] 12/02/2008 453313148042 453313148042

MOT TEST: 10 March 2011 09:03:30 PASSED
MOT TEST: 10 March 2011 09:03:30 PASSED

This test (155739561435) was completed on the 10 March 2011 09:03:30 and PASSED the requirements for a valid MOT with 0 comments.

This test (155739561435) was completed on the 10 March 2011 09:03:30 and PASSED the requirements for a valid MOT with 0 comments.

Recorded mileage: 91,894

Recorded mileage: 91,894


MOT TEST: 04 March 2011 16:45:02 FAILED
MOT TEST: 04 March 2011 16:45:02 FAILED

This test (469343061084) was completed on the 04 March 2011 16:45:02 and FAILED the requirements for a valid MOT with 4 comments.

This test (469343061084) was completed on the 04 March 2011 16:45:02 and FAILED the requirements for a valid MOT with 4 comments.

Recorded mileage: 91,894

Recorded mileage: 91,894


FAIL


MOT TEST: 25 September 2009 15:08:35 PASSED
MOT TEST: 25 September 2009 15:08:35 PASSED

This test (391488969410) was completed on the 25 September 2009 15:08:35 and PASSED the requirements for a valid MOT with 1 comments.

This test (391488969410) was completed on the 25 September 2009 15:08:35 and PASSED the requirements for a valid MOT with 1 comments.

Recorded mileage: 91,893

Recorded mileage: 91,893


ADVISORY


MOT TEST: 19 February 2008 16:34:49 PASSED
MOT TEST: 19 February 2008 16:34:49 PASSED

This test (324240958090) was completed on the 19 February 2008 16:34:49 and PASSED the requirements for a valid MOT with 0 comments.

This test (324240958090) was completed on the 19 February 2008 16:34:49 and PASSED the requirements for a valid MOT with 0 comments.

Recorded mileage: 91,893

Recorded mileage: 91,893


MOT TEST: 12 February 2008 11:33:12 FAILED
MOT TEST: 12 February 2008 11:33:12 FAILED

This test (453313148042) was completed on the 12 February 2008 11:33:12 and FAILED the requirements for a valid MOT with 5 comments.

This test (453313148042) was completed on the 12 February 2008 11:33:12 and FAILED the requirements for a valid MOT with 5 comments.

Recorded mileage: 91,893

Recorded mileage: 91,893


FAIL

USER ENTERED


MOT TEST: 24 February 2006 16:24:26 PASSED
MOT TEST: 24 February 2006 16:24:26 PASSED

This test (360975656001) was completed on the 24 February 2006 16:24:26 and PASSED the requirements for a valid MOT with 0 comments.

This test (360975656001) was completed on the 24 February 2006 16:24:26 and PASSED the requirements for a valid MOT with 0 comments.

Recorded mileage: 90,400

Recorded mileage: 90,400


MOT TEST: 22 February 2006 11:41:39 FAILED
MOT TEST: 22 February 2006 11:41:39 FAILED

This test (152323556042) was completed on the 22 February 2006 11:41:39 and FAILED the requirements for a valid MOT with 3 comments.

This test (152323556042) was completed on the 22 February 2006 11:41:39 and FAILED the requirements for a valid MOT with 3 comments.

Recorded mileage: 90,398

Recorded mileage: 90,398


FAIL