564 FAX


564FAX is registered to a Red 1962, Morris Minor 1000 with a Petrol engine. It Failed its most recent MOT Test on the 02 July 2015

26 unique faults (35 Total) reported in its MOT History (16 Tests).

7 common/recurring faults, the most frequent (3 times) is: Service brake: efficiency below requirements (3.7.B.7).

56% (9) MOT Pass Rate and a 44% (7) MOT Failure Rate.

27,339 recorded miles.

564 FAX


564FAX is registered to a Red 1962, Morris Minor 1000 with a Petrol engine. It Failed its most recent MOT Test on the 02 July 2015

26 unique faults (35 Total) reported in its MOT History (16 Tests).

7 common/recurring faults, the most frequent (3 times) is: Service brake: efficiency below requirements (3.7.B.7).

56% (9) MOT Pass Rate and a 44% (7) MOT Failure Rate.

27,339 recorded miles.

MOT PASS/Failure rate for 564 FAX

all MOT test results for 564 FAX represented as a percentage
MOT PASS/Failure rate for 564 FAX
all MOT test results for 564 FAX represented as a percentage

PERCENTAGE OF VEHICLE FAULTS WITH 564 FAX

ALL REPORTED FAULTS, DISPLAYED BY PERCENTAGE OF OCCURRENCE DURING ALL MOT TESTS
PERCENTAGE OF VEHICLE FAULTS WITH 564 FAX
ALL REPORTED FAULTS, DISPLAYED BY PERCENTAGE OF OCCURRENCE DURING ALL MOT TESTS
ADVISORY

FAIL

USER ENTERED

564 FAX annual Faults by type

ALL REPORTED FAULTS, DISPLAYED over time and categorised by type
564 FAX annual Faults by type
ALL REPORTED FAULTS, DISPLAYED over time and categorised by type

RECURRING FAULTS WITH 564 FAX

FAULTS THAT HAVE OCCURED MORE THAN ONCE DURING 564 FAX's MOT HISTORY
RECURRING FAULTS WITH 564 FAX
FAULTS THAT HAVE OCCURED MORE THAN ONCE DURING 564 FAX's MOT HISTORY
Fault Fault Test Date Test Date/Time Reference MOT Test Reference
3 Service brake: efficiency below requirements (3.7.b.7) Service brake: efficiency below requirements (3.7.b.7) 30 June 2015 [15:53] 30/06/2015 29 May 2013 [11:16] 29/05/2013 09 March 2011 [14:22] 09/03/2011 608751785139 608751785139 465559543123 465559543123 796938661061 796938661061
3 Nearside rear suspension spring mounting prescribed area is excessively corroded (2.4.a.3) Nearside rear suspension spring mounting prescribed area is excessively corroded (2.4.a.3) 17 March 2010 [12:53] 17/03/2010 29 August 2007 [12:11] 29/08/2007 27 July 2006 [17:05] 27/07/2006 572376770080 572376770080 772371147234 772371147234 194218906248 194218906248
2 Parking brake: efficiency below requirements (3.7.b.7) Parking brake: efficiency below requirements (3.7.b.7) 29 May 2013 [11:16] 29/05/2013 09 March 2011 [14:22] 09/03/2011 465559543123 465559543123 796938661061 796938661061
2 Nearside rear parking brake recording little or no effort (3.7.b.6a) Nearside rear parking brake recording little or no effort (3.7.b.6a) 29 May 2013 [11:16] 29/05/2013 09 March 2011 [14:22] 09/03/2011 465559543123 465559543123 796938661061 796938661061
2 Slight binding both front and rear wheels Slight binding both front and rear wheels 11 March 2011 [13:36] 11/03/2011 09 March 2011 [14:22] 09/03/2011 335010071055 335010071055 796938661061 796938661061
2 Nearside front position lamp(s) not working (1.1.a.3b) Nearside front position lamp(s) not working (1.1.a.3b) 09 March 2011 [14:22] 09/03/2011 17 March 2010 [12:53] 17/03/2010 796938661061 796938661061 572376770080 572376770080
2 Nearside front front suspension has slight play in a lower suspension ball joint (2.5.b.1a) Nearside front front suspension has slight play in a lower suspension ball joint (2.5.b.1a) 03 September 2007 [14:50] 03/09/2007 29 August 2007 [12:11] 29/08/2007 664336347220 664336347220 772371147234 772371147234

ALL 564 FAX ADVISORIES [2]

ALL ADVISORIES, ORDERED by OCCURRENCE DURING 564 FAX's MOT HISTORY
ALL 564 FAX ADVISORIES [2]
ALL ADVISORIES, ORDERED by OCCURRENCE DURING 564 FAX's MOT HISTORY
Advisory Faults | source www.vehiclestats.co.uk
Fault Fault Test Date Test Date/Time Reference MOT Test Reference
2 Nearside front front suspension has slight play in a lower suspension ball joint (2.5.b.1a) Nearside front front suspension has slight play in a lower suspension ball joint (2.5.b.1a) 03 September 2007 [14:50] 03/09/2007 29 August 2007 [12:11] 29/08/2007 664336347220 664336347220 772371147234 772371147234

ALL 564 FAX Failure Faults [31]

ALL Failure faults, ORDERED by OCCURRENCE DURING 564 FAX's MOT HISTORY
ALL 564 FAX Failure Faults [31]
ALL Failure faults, ORDERED by OCCURRENCE DURING 564 FAX's MOT HISTORY
Fail Faults | source www.vehiclestats.co.uk
Fault Fault Test Date Test Date/Time Reference MOT Test Reference
3 Service brake: efficiency below requirements (3.7.b.7) Service brake: efficiency below requirements (3.7.b.7) 30 June 2015 [15:53] 30/06/2015 29 May 2013 [11:16] 29/05/2013 09 March 2011 [14:22] 09/03/2011 608751785139 608751785139 465559543123 465559543123 796938661061 796938661061
3 Nearside rear suspension spring mounting prescribed area is excessively corroded (2.4.a.3) Nearside rear suspension spring mounting prescribed area is excessively corroded (2.4.a.3) 17 March 2010 [12:53] 17/03/2010 29 August 2007 [12:11] 29/08/2007 27 July 2006 [17:05] 27/07/2006 572376770080 572376770080 772371147234 772371147234 194218906248 194218906248
2 Parking brake: efficiency below requirements (3.7.b.7) Parking brake: efficiency below requirements (3.7.b.7) 29 May 2013 [11:16] 29/05/2013 09 March 2011 [14:22] 09/03/2011 465559543123 465559543123 796938661061 796938661061
2 Nearside rear parking brake recording little or no effort (3.7.b.6a) Nearside rear parking brake recording little or no effort (3.7.b.6a) 29 May 2013 [11:16] 29/05/2013 09 March 2011 [14:22] 09/03/2011 465559543123 465559543123 796938661061 796938661061
2 Nearside front position lamp(s) not working (1.1.a.3b) Nearside front position lamp(s) not working (1.1.a.3b) 09 March 2011 [14:22] 09/03/2011 17 March 2010 [12:53] 17/03/2010 796938661061 796938661061 572376770080 572376770080
1 Offside front brake binding (3.7.b.1) Offside front brake binding (3.7.b.1) 30 June 2015 [15:53] 30/06/2015 608751785139 608751785139
1 Nearside rear brake binding (3.7.b.1) Nearside rear brake binding (3.7.b.1) 30 June 2015 [15:53] 30/06/2015 608751785139 608751785139
1 Nearside headlamp not working on dipped beam (1.7.5a) Nearside headlamp not working on dipped beam (1.7.5a) 24 June 2014 [09:39] 24/06/2014 179225374192 179225374192
1 Exhaust has a major leak of exhaust gases (7.1.2) Exhaust has a major leak of exhaust gases (7.1.2) 29 May 2013 [11:16] 29/05/2013 465559543123 465559543123
1 Nearside rear brake recording little or no effort (3.7.b.5a) Nearside rear brake recording little or no effort (3.7.b.5a) 29 May 2013 [11:16] 29/05/2013 465559543123 465559543123
1 Nearside front brake recording little or no effort (3.7.b.5a) Nearside front brake recording little or no effort (3.7.b.5a) 29 May 2013 [11:16] 29/05/2013 465559543123 465559543123
1 Nearside registration plate lamp not working (1.1.c.1d) Nearside registration plate lamp not working (1.1.c.1d) 09 March 2011 [14:22] 09/03/2011 796938661061 796938661061
1 Fuel cap/sealing device sealing washer missing (7.2.4c) Fuel cap/sealing device sealing washer missing (7.2.4c) 09 March 2011 [14:22] 09/03/2011 796938661061 796938661061
1 Nearside front suspension component mounting prescribed area is excessively corroded (2.4.a.3) Nearside front suspension component mounting prescribed area is excessively corroded (2.4.a.3) 09 March 2011 [14:22] 09/03/2011 796938661061 796938661061
1 Nearside parking brake lever defective so that it cannot be satisfactorily operated (3.1.3c) Nearside parking brake lever defective so that it cannot be satisfactorily operated (3.1.3c) 09 March 2011 [14:22] 09/03/2011 796938661061 796938661061
1 Exhaust system not adequately supported (7.1.1) Exhaust system not adequately supported (7.1.1) 17 March 2010 [12:53] 17/03/2010 572376770080 572376770080
1 Nearside rear suspension spring mounting prescribed area is inadequately repaired (2.4.a.3) Nearside rear suspension spring mounting prescribed area is inadequately repaired (2.4.a.3) 29 August 2007 [12:11] 29/08/2007 772371147234 772371147234
1 Offside front brake pipe inadequately clipped (3.6.b.1) Offside front brake pipe inadequately clipped (3.6.b.1) 29 August 2007 [12:11] 29/08/2007 772371147234 772371147234
1 Offside rear brake pipe inadequately clipped (3.6.b.1) Offside rear brake pipe inadequately clipped (3.6.b.1) 29 August 2007 [12:11] 29/08/2007 772371147234 772371147234
1 Nearside front front brake binding (3.7.b.1) Nearside front front brake binding (3.7.b.1) 29 August 2007 [12:11] 29/08/2007 772371147234 772371147234
1 Nearside rear front brake recording little or no effort (3.7.b.5a) Nearside rear front brake recording little or no effort (3.7.b.5a) 29 August 2007 [12:11] 29/08/2007 772371147234 772371147234
1 Brakes imbalanced across an axle (3.7.b.5b) Brakes imbalanced across an axle (3.7.b.5b) 29 August 2007 [12:11] 29/08/2007 772371147234 772371147234
1 Nearside vehicle structure has excessive corrosion which adversely affects braking or steering (6.1.a.1) Nearside vehicle structure has excessive corrosion which adversely affects braking or steering (6.1.a.1) 27 July 2006 [17:05] 27/07/2006 194218906248 194218906248
1 Centre exhaust mounting missing (7.1.1b) Centre exhaust mounting missing (7.1.1b) 27 July 2006 [17:05] 27/07/2006 194218906248 194218906248

ALL 564 FAX User Entered Faults [2]

ALL User Entered faults, ORDERED by OCCURRENCE DURING 564 FAX's MOT HISTORY
ALL 564 FAX User Entered Faults [2]
ALL User Entered faults, ORDERED by OCCURRENCE DURING 564 FAX's MOT HISTORY
User Entered Faults | source www.vehiclestats.co.uk
Fault Fault Test Date Test Date/Time Reference MOT Test Reference
2 Slight binding both front and rear wheels Slight binding both front and rear wheels 11 March 2011 [13:36] 11/03/2011 09 March 2011 [14:22] 09/03/2011 335010071055 335010071055 796938661061 796938661061

MOT TEST: 02 July 2015 16:08:50 PASSED
MOT TEST: 02 July 2015 16:08:50 PASSED

This test (346193485139) was completed on the 02 July 2015 16:08:50 and PASSED the requirements for a valid MOT with 0 comments.

This test (346193485139) was completed on the 02 July 2015 16:08:50 and PASSED the requirements for a valid MOT with 0 comments.

Recorded mileage: 24,578

Recorded mileage: 24,578


MOT TEST: 30 June 2015 15:53:00 FAILED
MOT TEST: 30 June 2015 15:53:00 FAILED

This test (608751785139) was completed on the 30 June 2015 15:53:00 and FAILED the requirements for a valid MOT with 3 comments.

This test (608751785139) was completed on the 30 June 2015 15:53:00 and FAILED the requirements for a valid MOT with 3 comments.

Recorded mileage: 24,577

Recorded mileage: 24,577


FAIL


MOT TEST: 24 June 2014 13:15:00 PASSED
MOT TEST: 24 June 2014 13:15:00 PASSED

This test (315295974113) was completed on the 24 June 2014 13:15:00 and PASSED the requirements for a valid MOT with 0 comments.

This test (315295974113) was completed on the 24 June 2014 13:15:00 and PASSED the requirements for a valid MOT with 0 comments.

Recorded mileage: 24,549

Recorded mileage: 24,549


MOT TEST: 24 June 2014 09:39:44 FAILED
MOT TEST: 24 June 2014 09:39:44 FAILED

This test (179225374192) was completed on the 24 June 2014 09:39:44 and FAILED the requirements for a valid MOT with 1 comments.

This test (179225374192) was completed on the 24 June 2014 09:39:44 and FAILED the requirements for a valid MOT with 1 comments.

Recorded mileage: 24,549

Recorded mileage: 24,549


FAIL


MOT TEST: 07 June 2013 10:57:46 PASSED
MOT TEST: 07 June 2013 10:57:46 PASSED

This test (248598953144) was completed on the 07 June 2013 10:57:46 and PASSED the requirements for a valid MOT with 0 comments.

This test (248598953144) was completed on the 07 June 2013 10:57:46 and PASSED the requirements for a valid MOT with 0 comments.

Recorded mileage: 24,470

Recorded mileage: 24,470


MOT TEST: 29 May 2013 11:16:09 FAILED
MOT TEST: 29 May 2013 11:16:09 FAILED

This test (465559543123) was completed on the 29 May 2013 11:16:09 and FAILED the requirements for a valid MOT with 6 comments.

This test (465559543123) was completed on the 29 May 2013 11:16:09 and FAILED the requirements for a valid MOT with 6 comments.

Recorded mileage: 24,470

Recorded mileage: 24,470


FAIL


MOT TEST: 07 June 2012 14:19:21 PASSED
MOT TEST: 07 June 2012 14:19:21 PASSED

This test (828279452193) was completed on the 07 June 2012 14:19:21 and PASSED the requirements for a valid MOT with 0 comments.

This test (828279452193) was completed on the 07 June 2012 14:19:21 and PASSED the requirements for a valid MOT with 0 comments.

Recorded mileage: 24,296

Recorded mileage: 24,296


MOT TEST: 11 March 2011 13:36:31 PASSED
MOT TEST: 11 March 2011 13:36:31 PASSED

This test (335010071055) was completed on the 11 March 2011 13:36:31 and PASSED the requirements for a valid MOT with 1 comments.

This test (335010071055) was completed on the 11 March 2011 13:36:31 and PASSED the requirements for a valid MOT with 1 comments.

Recorded mileage: 24,049

Recorded mileage: 24,049


USER ENTERED


MOT TEST: 09 March 2011 14:22:57 FAILED
MOT TEST: 09 March 2011 14:22:57 FAILED

This test (796938661061) was completed on the 09 March 2011 14:22:57 and FAILED the requirements for a valid MOT with 9 comments.

This test (796938661061) was completed on the 09 March 2011 14:22:57 and FAILED the requirements for a valid MOT with 9 comments.

Recorded mileage: 24,049

Recorded mileage: 24,049


FAIL

USER ENTERED


MOT TEST: 19 March 2010 12:08:47 PASSED
MOT TEST: 19 March 2010 12:08:47 PASSED

This test (123418670079) was completed on the 19 March 2010 12:08:47 and PASSED the requirements for a valid MOT with 0 comments.

This test (123418670079) was completed on the 19 March 2010 12:08:47 and PASSED the requirements for a valid MOT with 0 comments.

Recorded mileage: 23,957

Recorded mileage: 23,957


MOT TEST: 17 March 2010 12:53:26 FAILED
MOT TEST: 17 March 2010 12:53:26 FAILED

This test (572376770080) was completed on the 17 March 2010 12:53:26 and FAILED the requirements for a valid MOT with 3 comments.

This test (572376770080) was completed on the 17 March 2010 12:53:26 and FAILED the requirements for a valid MOT with 3 comments.

Recorded mileage: 23,957

Recorded mileage: 23,957


FAIL


MOT TEST: 23 February 2009 10:54:38 PASSED
MOT TEST: 23 February 2009 10:54:38 PASSED

This test (902384759052) was completed on the 23 February 2009 10:54:38 and PASSED the requirements for a valid MOT with 0 comments.

This test (902384759052) was completed on the 23 February 2009 10:54:38 and PASSED the requirements for a valid MOT with 0 comments.

Recorded mileage: 27,339

Recorded mileage: 27,339


MOT TEST: 03 September 2007 14:50:47 PASSED
MOT TEST: 03 September 2007 14:50:47 PASSED

This test (664336347220) was completed on the 03 September 2007 14:50:47 and PASSED the requirements for a valid MOT with 1 comments.

This test (664336347220) was completed on the 03 September 2007 14:50:47 and PASSED the requirements for a valid MOT with 1 comments.

Recorded mileage: 22,455

Recorded mileage: 22,455


ADVISORY


MOT TEST: 29 August 2007 12:11:12 FAILED
MOT TEST: 29 August 2007 12:11:12 FAILED

This test (772371147234) was completed on the 29 August 2007 12:11:12 and FAILED the requirements for a valid MOT with 8 comments.

This test (772371147234) was completed on the 29 August 2007 12:11:12 and FAILED the requirements for a valid MOT with 8 comments.

Recorded mileage: 22,445

Recorded mileage: 22,445


ADVISORY

FAIL


MOT TEST: 28 July 2006 14:11:40 PASSED
MOT TEST: 28 July 2006 14:11:40 PASSED

This test (820299006273) was completed on the 28 July 2006 14:11:40 and PASSED the requirements for a valid MOT with 0 comments.

This test (820299006273) was completed on the 28 July 2006 14:11:40 and PASSED the requirements for a valid MOT with 0 comments.

Recorded mileage: 21,963

Recorded mileage: 21,963


MOT TEST: 27 July 2006 17:05:21 FAILED
MOT TEST: 27 July 2006 17:05:21 FAILED

This test (194218906248) was completed on the 27 July 2006 17:05:21 and FAILED the requirements for a valid MOT with 3 comments.

This test (194218906248) was completed on the 27 July 2006 17:05:21 and FAILED the requirements for a valid MOT with 3 comments.

Recorded mileage: 21,963

Recorded mileage: 21,963


FAIL